{
  "locationIndicatorMWO": "EHDB",
  "locationIndicatorATSU": "EHAA",
  "locationIndicatorATSR": "EHAA",
  "firName": "AMSTERDAM FIR",
  "endGeometryIntersect": {
    "type": "FeatureCollection",
    "features": [
      {
        "type": "Feature",
        "properties": {
          "selectionType": "poly",
          "stroke": "#6e1e91",
          "stroke-width": 1.5,
          "stroke-opacity": 1,
          "fill": "#6e1e91",
          "fill-opacity": 0.5
        },
        "geometry": {
          "type": "Polygon",
          "coordinates": [
            [
              [4.999999, 54.999999],
              [6.500002, 55.000002],
              [6.5, 53.666667],
              [7.191667, 53.3],
              [7.14218, 52.898244],
              [7.133055, 52.888887],
              [7.065557, 52.385828],
              [7.063612, 52.346109],
              [7.031389, 52.268885],
              [7.053095, 52.237764],
              [6.405001, 51.830828],
              [5.94639, 51.811663],
              [6.222223, 51.361666],
              [5.934168, 51.036386],
              [6.011797, 50.757273],
              [5.651667, 50.824717],
              [5.848333, 51.139444],
              [5.078611, 51.391665],
              [4.397501, 51.452776],
              [3.952501, 51.214441],
              [3.373613, 51.309999],
              [3.36389, 51.313608],
              [3.362223, 51.320002],
              [3.370001, 51.369722],
              [2.000002, 51.500002],
              [3.15576, 52.913554],
              [2.761908, 54.379261],
              [3.368817, 55.764314],
              [4.331914, 55.332644],
              [4.999999, 54.999999]
            ]
          ]
        }
      }
    ]
  },
  "level": {
    "value": 150,
    "unit": "FL"
  },
  "isObservationOrForecast": "OBS",
  "levelInfoMode": "AT",
  "change": "NC",
  "phenomenon": "SEV_ICE",
  "endGeometry": {
    "type": "FeatureCollection",
    "features": [
      {
        "type": "Feature",
        "geometry": {
          "type": "Polygon",
          "coordinates": [
            [
              [4.999999, 54.999999],
              [5.000002, 55.000002],
              [6.500002, 55.000002],
              [6.5, 53.666667],
              [7.191667, 53.3],
              [7.14218, 52.898244],
              [7.133055, 52.888887],
              [7.065557, 52.385828],
              [7.063612, 52.346109],
              [7.031389, 52.268885],
              [7.053095, 52.237764],
              [6.405001, 51.830828],
              [5.94639, 51.811663],
              [6.222223, 51.361666],
              [5.934168, 51.036386],
              [6.011797, 50.757273],
              [5.651667, 50.824717],
              [5.848333, 51.139444],
              [5.078611, 51.391665],
              [4.397501, 51.452776],
              [3.952501, 51.214441],
              [3.373613, 51.309999],
              [3.36389, 51.313608],
              [3.362223, 51.320002],
              [3.370527, 51.36867],
              [3.370001, 51.369722],
              [2.000002, 51.500002],
              [3.15576, 52.913554],
              [2.761908, 54.379261],
              [3.368817, 55.764314],
              [4.331914, 55.332644],
              [5, 55],
              [4.999999, 54.999999]
            ]
          ]
        },
        "properties": {
          "centlong": 4.98042633,
          "REGION": "EUR",
          "StateName": "Netherlands",
          "FIRname": "AMSTERDAM FIR",
          "StateCode": "NLD",
          "centlat": 52.8618788,
          "ICAOCODE": "EHAA",
          "stroke": "#6e1e91",
          "stroke-width": 1.5,
          "stroke-opacity": 1,
          "fill": "#6e1e91",
          "fill-opacity": 0.25,
          "selectionType": "fir"
        }
      }
    ]
  },
  "type": "TEST",
  "observationOrForecastTime": "2020-11-09T12:00:00Z",
  "startGeometry": {
    "type": "FeatureCollection",
    "features": [
      {
        "type": "Feature",
        "properties": {
          "stroke": "#f24a00",
          "stroke-width": 1.5,
          "stroke-opacity": 1,
          "fill": "#f24a00",
          "fill-opacity": 0.25,
          "selectionType": "poly"
        },
        "geometry": {
          "type": "Polygon",
          "coordinates": [
            [
              [0.422294625457749, 53.34485107530248],
              [9.474878354760275, 50.5920689172472],
              [2.7887376750264585, 50.016278362162964],
              [0.422294625457749, 53.34485107530248]
            ]
          ]
        }
      }
    ]
  },
  "sequence": "A02",
  "movementType": "FORECAST_POSITION",
  "validDateStart": "2020-11-09T13:15:00Z",
  "issueDate": "2020-11-09T13:13:26Z",
  "validDateEnd": "2020-11-09T14:59:29Z",
  "startGeometryIntersect": {
    "type": "FeatureCollection",
    "features": [
      {
        "type": "Feature",
        "properties": {
          "stroke": "#f24a00",
          "stroke-width": 1.5,
          "stroke-opacity": 1,
          "fill": "#f24a00",
          "fill-opacity": 0.5
        },
        "geometry": {
          "type": "Polygon",
          "coordinates": [
            [
              [2.8938868426187137, 52.59326954134807],
              [6.056855262843627, 51.6314487512196],
              [6.222223, 51.361666],
              [5.934168, 51.036386],
              [6.011797, 50.757273],
              [5.651667, 50.824717],
              [5.848333, 51.139444],
              [5.078611, 51.391665],
              [4.397501, 51.452776],
              [3.952501, 51.214441],
              [3.373613, 51.309999],
              [3.36389, 51.313608],
              [3.362223, 51.320002],
              [3.370001, 51.369722],
              [2.000002, 51.500002],
              [2.8938868426187137, 52.59326954134807]
            ]
          ]
        }
      }
    ]
  },
  "status": "PUBLISHED"
}
