{
  "type": "FeatureCollection",
  "features": [
    {
      "type": "Feature",
      "properties": {
        "fill": "",
        "stroke": "",
        "stroke-width": 2,
        "stroke-opacity": 1,
        "details": {
          "identifier": "2.49.0.1.578.0.221031100000.7009_1_0",
          "severity": "Moderate",
          "certainty": "Likely",
          "onset": "2022-11-01T12:00:00+00:00",
          "expires": "2022-11-01T18:00:00+00:00",
          "languages": [
            {
              "areaDesc": "North Utsire and Viking",
              "language": "en-GB",
              "event": "Gale",
              "senderName": "MET Norway",
              "headline": "Gale Force, North Utsire, 01 November 12:00 UTC to 01 November 18:00 UTC.",
              "description": "Southeast gale 8."
            }
          ]
        }
      },
      "geometry": {
        "type": "MultiPolygon",
        "coordinates": [
          [
            [
              [4.4548, 61.0],
              [4.0, 61.0],
              [3.9943, 58.9995],
              [5.217, 59.0027],
              [5.1062, 59.0903],
              [4.9815, 59.1515],
              [4.8945, 59.2078],
              [4.8257, 59.2993],
              [4.823, 59.3715],
              [4.8698, 59.4647],
              [4.9415, 59.6488],
              [4.878, 59.9992],
              [4.7958, 60.2412],
              [4.5137, 60.7568],
              [4.4548, 61.0]
            ]
          ],
          [
            [
              [1.0065, 61.0068],
              [0.0008, 60.9992],
              [0.0, 58.5],
              [4.0, 58.5],
              [3.995, 58.9988],
              [4.0, 61.0],
              [3.4897, 61.006],
              [2.4917, 61.0008],
              [1.0065, 61.0068]
            ]
          ]
        ]
      }
    }
  ]
}
