{
    "creationDate": "2020-12-17T08:00:00Z",
    "canbe": [
        "CANCELLED",
        "AMENDED",
        "CORRECTED",
        "DRAFTED"
    ],
    "taf": {
        "uuid": "6523462362456sw45g",
        "issueDate": "2020-12-17T08:00:00Z",
        "baseTime": "2020-12-17T08:00:00Z",
        "validDateStart": "2020-12-17T08:00:00Z",
        "validDateEnd": "2020-12-19T00:00:00Z",
        "location": "EHRD",
        "status": "AMENDED",
        "type": "NORMAL",
        "messageType": "ORG",
        "baseForecast": {
            "cavOK": true,
            "valid": {
                "start": "2020-12-17T08:00:00Z",
                "end": "2020-12-19T00:00:00Z"
            },
            "wind": {
                "direction": 180,
                "speed": 10,
                "unit": "KT"
            }
        },
        "changeGroups": [
            {
                "change": "BECMG",
                "valid": {
                    "start": "2020-12-17T08:00:00Z",
                    "end": "2020-12-19T00:00:00Z"
                },
                "weather": {
                    "weather1": "MIFG"
                }
            },
            {
                "change": "FM",
                "valid": {
                    "start": "2020-12-17T08:00:00Z"
                },
                "weather": {
                    "weather1": "+SHRA"
                }
            }
        ]
    }
}
