{
    "creationDate": "2020-12-16T18:00:00Z",
    "uuid": "5f9583fjdf0f337925",
    "canbe": [
        "DRAFTED",
        "DISCARDED",
        "PUBLISHED"
    ],
    "taf": {
        "uuid": "5f9583fjdf0f337925",
        "baseTime": "2020-12-17T12:00:00Z",
        "validDateStart": "2020-12-17T12:00:00Z",
        "validDateEnd": "2020-12-18T18:00:00Z",
        "location": "EHAM",
        "status": "NEW",
        "type": "NORMAL",
        "messageType": "ORG",
        "baseForecast": {
            "valid": {
                "start": "2020-12-17T12:00:00Z",
                "end": "2020-12-18T18:00:00Z"
            }
        }
    }
}
