{
    "uuid": "68bc95f8-4edc-11ed-b16f-1e9fb9a83007",
    "taf": {
      "messageType": "ORG",
      "location": "EHAM",
      "validDateStart": "2020-10-18T18:00:00Z",
      "uuid": "68bc95f8-4edc-11ed-b16f-1e9fb9a83007",
      "baseTime": "2020-10-18T18:00:00Z",
      "validDateEnd": "2020-10-20T00:00:00Z",
      "baseForecast": {
        "valid": {
          "start": "2020-10-18T18:00:00Z",
          "end": "2020-10-20T00:00:00Z"
        }
      },
      "status": "NEW"
    },
    "creationDate": "2020-10-18T18:00:00Z",
    "canbe": [
      "DRAFTED",
      "DISCARDED",
      "PUBLISHED"
    ],
    "editor": null
  }
