solid Mesh
  facet normal 0.000000 -1.000000 0.000000
    outer loop
      vertex 200.000000 -210.000000 0.000000
      vertex 220.000000 -210.000000 0.000000
      vertex 220.000000 -210.000000 20.000000
    endloop
  endfacet
  facet normal 0.000000 -1.000000 0.000000
    outer loop
      vertex 200.000000 -210.000000 0.000000
      vertex 220.000000 -210.000000 20.000000
      vertex 200.000000 -210.000000 20.000000
    endloop
  endfacet
endsolid Mesh
