solid _inlet
 facet normal -1 0 0
  outer loop
   vertex 0 0.01 0
   vertex 0 -0.01 0
   vertex 0 0.01 0.02
  endloop
 endfacet
 facet normal -1 -0 0
  outer loop
   vertex 0 0.01 0.02
   vertex 0 -0.01 0
   vertex 0 -0.01 0.02
  endloop
 endfacet
endsolid _inlet
