// Example Controller Test case
import AccountsController from "../../../mapping/AccountsController";

describe("AccountsController Test Stub", ()=>{

    it('Parse Accounts request message using Accounts Controller', () =>{        
        let accountController:AccountsController = new AccountsController('{"account":{"number":"1234567891122","secret":{"type":"","code":""}}}');                
        expect(accountController.reqThroughAccBO).not.toEqual(null); 
    });

    it('Parsing error scenario', ()=>{
        try{
            let accountController:AccountsController = new AccountsController('asdfasdf');                
        }catch(error){
            expect(error).toBeDefined();
        }            
    });

    it('Generate a response 0000 based on the request', () =>{        
        let accountController:AccountsController = new AccountsController(JSON.parse('{"account":{"number":"1234567891122","secret":{"type":"","code":""}}}'));                
        accountController.registerThroughAccount().then((result:String) =>{
            expect(result.length > 0).toBeTruthy();
        }).catch((error:any) => {            
            fail(error);
        });             
    });

    it('Generate a response 8404 based on the request', () =>{        
        let accountController:AccountsController = new AccountsController(JSON.parse('{"account":{"number":"1234567891999","secret":{"type":"","code":""}}}'));                
        accountController.registerThroughAccount().then((result:String) =>{
            expect(result).not.toBeDefined();
        }).catch((error:any) => {
            expect(error).toBeDefined();
            expect(JSON.parse(error).metadata.status).toBe("8404");
        });     
    });



});