{
    "finances": [
        {
            "id" : "LD1715253561",
            "cif" : "1234567",
            "type": 21058,
            "desc": "Qard Hassan", 
            "loanAmount": 30000, 
            "loanCCY": "AED",
            "loanAmountLCY": 7500, 
            "outstandingAmt" : 7500, 
            "startDate": "2017-06-01",
            "maturityDate" : "2021-05-24",
            "tenor" : 47,
            "drawDownAccountNumber": "0011670270001", 
            "repayFrequency": "M",
            "lastPaymentDate": "2020-05-24",
            "nextRepaydate": "2020-06-24",
            "nextRepayAmount": 625.00,
            "accountCategory": "LAA"
        },
        {
            "id" : "LD1722414710", 
            "cif" : "1234568",
            "type": 21050,
            "desc": "Personal Finance - Bonds", 
            "loanAmount": 30000, 
            "loanCCY": "AED",
            "loanAmountLCY": 7500, 
            "outstandingAmt" : 7500, 
            "startDate": "2017-06-01",
            "maturityDate" : "2021-05-24",
            "tenor" : 47,
            "drawDownAccountNumber": "0011670270001", 
            "repayFrequency": "M",
            "lastPaymentDate": "2020-05-24",
            "nextRepaydate": "2020-06-24",
            "nextRepayAmount": 625.00,
            "accountCategory": "LAA"
        }        
    ]
         
 }