{
    "deposits":[
        {
            "cif": "1234567",
            "contractID":"MM1630907380",
            "type":"21016",
            "typeDesc":"One Month Term Deposit",
            "name":"One Month Dep",
            "currency":"AED",
            "amount":138703.07,
            "amountLCY":138703.07,
            "startDate":"2016-11-01",
            "maturityDate":"2020-06-30",
            "periodCode":"1M",
            "autoRolloverFlag":"Y",
            "autoRolloverCounter":0,
            "drawdownAccountNumber":"AED1606401000030",
            "princLiquidationAccount":"0011657780001",
            "profitLiquidationAccount":"AED1606401000030",
            "branchID":"AE0010030",
            "profitRate":1,
            "category":"FDA",
            "status":"001",
            "accountTitle":"Title-1 0011657780001"
        },
        {
            "cif": "1234567",
            "contractID": "MM2015306009",
            "type": "21018",
            "typeDesc": "Six Month Term Deposit",
            "name": "Six Month Dep",
            "currency": "AED",
            "amount": 10001.00,
            "amountLCY": 10001.00,
            "startDate": "2020-06-01",
            "maturityDate": "2020-12-01",
            "periodCode": "6M",
            "autoRolloverFlag": "Y",
            "autoRolloverCounter": "0",
            "drawdownAccountNumber": "0011657780001",
            "princLiquidationAccount": "0011657780002",
            "profitLiquidationAccount": "AED1606401000030",
            "branchID": "AE0010030",
            "profitRate": "1.71429",
            "category": "FDA",
            "status": "001",
            "accountTitle": "Title-1 0011657780002",
            "rolloverType": "MATINST2"
         },
         {
            "cif": "1234568",
            "contractID": "MM2015560043",
            "type": "21016",
            "typeDesc": "One Month Term Deposit",
            "name": "One Month Dep",
            "currency": "AED",
            "amount": 11112.00,
            "amountLCY": 11112.00,
            "startDate": "2020-06-03",
            "maturityDate": "2020-07-03",
            "periodCode": "1M",
            "autoRolloverFlag": "Y",
            "autoRolloverCounter": "0",
            "drawdownAccountNumber": "0011657780002",
            "princLiquidationAccount": "0011657780001",
            "profitLiquidationAccount": "AED1606401000030",
            "branchID": "AE0010030",
            "profitRate": "1.375",
            "category": "FDA",
            "status": "001",
            "accountTitle": "Title-1 0011657780001",
            "rolloverType": "MATINST1"
         },
         {
            "cif": "1234568",
            "contractID": "MM2015901971",
            "type": "21016",
            "typeDesc": "One Month Term Deposit",
            "name": "One Month Dep",
            "currency": "AED",
            "amount": 13033.00,
            "amountLCY": 13033.00,
            "startDate": "2020-06-07",
            "maturityDate": "2020-07-07",
            "periodCode": "1M",
            "autoRolloverFlag": "Y",
            "autoRolloverCounter": "0",
            "drawdownAccountNumber": "0011657780001",
            "princLiquidationAccount": "0011657780002",
            "profitLiquidationAccount": "AED1606401000030",
            "branchID": "AE0010030",
            "profitRate": "1.375",
            "category": "FDA",
            "status": "001",
            "accountTitle": "Title-1 0011657780002",
            "rolloverType": "MATINST2"
         },
         {
            "cif": "1234569",
            "contractID": "MM2015949054",
            "type": "21016",
            "typeDesc": "One Month Term Deposit",
            "name": "One Month Dep",
            "currency": "AED",
            "amount": 12011.00,
            "amountLCY": 12011.00,
            "startDate": "2020-06-07",
            "maturityDate": "2020-07-07",
            "periodCode": "1M",
            "autoRolloverFlag": "Y",
            "autoRolloverCounter": "0",
            "drawdownAccountNumber": "0011657780002",
            "princLiquidationAccount": "0011657780001",
            "profitLiquidationAccount": "AED1606401000030",
            "branchID": "AE0010030",
            "profitRate": "1.375",
            "category": "FDA",
            "status": "001",
            "accountTitle": "Title-1 0011657780001",
            "rolloverType": "MATINST1"
         },
         {
            "cif": "1234569",
            "contractID": "MM2015978596",
            "type": "21017",
            "typeDesc": "Three Month Term Deposit",
            "name": "Three Month Dep",
            "currency": "AED",
            "amount": 11234.00,
            "amountLCY": 11234.00,
            "startDate": "2020-06-07",
            "maturityDate": "2020-09-07",
            "periodCode": "3M",
            "autoRolloverFlag": "Y",
            "autoRolloverCounter": "0",
            "drawdownAccountNumber": "0011657780002",
            "princLiquidationAccount": "0011657780004",
            "profitLiquidationAccount": "AED1606401000030",
            "branchID": "AE0010030",
            "profitRate": "2.16071",
            "category": "FDA",
            "status": "001",
            "accountTitle": "Title-1 0011657780004",
            "rolloverType": "MATINST2"
         },
         {
            "cif": "1234569",
            "contractID": "MM2016702740",
            "type": "21016",
            "typeDesc": "One Month Term Deposit",
            "name": "One Month Dep",
            "currency": "AED",
            "amount": 12000.00,
            "amountLCY": 12000.00,
            "startDate": "2020-06-15",
            "maturityDate": "2020-07-15",
            "periodCode": "1M",
            "autoRolloverFlag": "Y",
            "autoRolloverCounter": "0",
            "drawdownAccountNumber": "0011393302001",
            "princLiquidationAccount": "0011393302001",
            "profitLiquidationAccount": "AED1606401000030",
            "branchID": "AE0010030",
            "profitRate": "1.375",
            "category": "FDA",
            "status": "001",
            "accountTitle": "Title-1 0011393302001",
            "rolloverType": "MATINST1"
         },
         {
            "cif": "1234570",
            "contractID": "MM2016712398",
            "type": "21016",
            "typeDesc": "One Month Term Deposit",
            "name": "One Month Dep",
            "currency": "AED",
            "amount": 13000.00,
            "amountLCY": 13000.00,
            "startDate": "2020-06-15",
            "maturityDate": "2020-07-15",
            "periodCode": "1M",
            "autoRolloverFlag": "Y",
            "autoRolloverCounter": "0",
            "drawdownAccountNumber": "0011657780002",
            "princLiquidationAccount": "0011657780001",
            "profitLiquidationAccount": "AED1606401000030",
            "branchID": "AE0010030",
            "profitRate": "1.375",
            "category": "FDA",
            "status": "001",
            "accountTitle": "Title-1 0011657780001",
            "rolloverType": "MATINST1"
         },
         {
            "cif": "1234570",
            "contractID": "MM2016738615",
            "type": "21016",
            "typeDesc": "One Month Term Deposit",
            "name": "One Month Dep",
            "currency": "AED",
            "amount": 12000.00,
            "amountLCY": 12000.00,
            "startDate": "2020-06-15",
            "maturityDate": "2020-07-15",
            "periodCode": "1M",
            "autoRolloverFlag": "Y",
            "autoRolloverCounter": "0",
            "drawdownAccountNumber": "0011657780002",
            "princLiquidationAccount": "0011393302001",
            "profitLiquidationAccount": "AED1606401000030",
            "branchID": "AE0010030",
            "profitRate": "1.375",
            "category": "FDA",
            "status": "001",
            "accountTitle": "Title-1 0011393302001",
            "rolloverType": "MATINST1"
         },
         {
            "cif": "1234570",
            "contractID": "MM2016795558",
            "type": "21016",
            "typeDesc": "One Month Term Deposit",
            "name": "One Month Dep",
            "currency": "AED",
            "amount": 12000.00,
            "amountLCY": 12000.00,
            "startDate": "2020-06-15",
            "maturityDate": "2020-07-15",
            "periodCode": "1M",
            "autoRolloverFlag": "Y",
            "autoRolloverCounter": "0",
            "drawdownAccountNumber": "0011657780002",
            "princLiquidationAccount": "0011657780001",
            "profitLiquidationAccount": "AED1606401000030",
            "branchID": "AE0010030",
            "profitRate": "1.375",
            "category": "FDA",
            "status": "001",
            "accountTitle": "Title-1 0011657780001",
            "rolloverType": "MATINST1"
         },
         {
            "cif": "1234571",
            "contractID": "MM2017930757",
            "type": "21016",
            "typeDesc": "One Month Term Deposit",
            "name": "One Month Dep",
            "currency": "AED",
            "amount": 13000.00,
            "amountLCY": 13000.00,
            "startDate": "2020-06-27",
            "maturityDate": "2020-07-27",
            "periodCode": "1M",
            "autoRolloverFlag": "Y",
            "autoRolloverCounter": 0,
            "drawdownAccountNumber": "0011657780002",
            "princLiquidationAccount": "0011657780001",
            "profitLiquidationAccount": "AED1606401000030",
            "branchID": "AE0010030",
            "profitRate": "1.375",
            "category": "FDA",
            "status": "001",
            "accountTitle": "Title-1 0011657780001",
            "rolloverType": "MATINST1"
         },
         {
            "cif": "1234571",
            "contractID": "MM2017956509",
            "type": "21016",
            "typeDesc": "One Month Term Deposit",
            "name": "One Month Dep",
            "currency": "AED",
            "amount": 13000.00,
            "amountLCY": 13000.00,
            "startDate": "2020-06-27",
            "maturityDate": "2020-07-27",
            "periodCode": "1M",
            "autoRolloverFlag": "Y",
            "autoRolloverCounter": 0,
            "drawdownAccountNumber": "0011657780002",
            "princLiquidationAccount": "0011657780001",
            "profitLiquidationAccount": "AED1606401000030",
            "branchID": "AE0010030",
            "profitRate": "1.375",
            "category": "FDA",
            "status": "001",
            "accountTitle": "Title-1 0011657780001",
            "rolloverType": "MATINST2"
         }
    ]
}