<?xml version="1.0" encoding="UTF-8" standalone="no"?>
<svg
   xmlns:dc="http://purl.org/dc/elements/1.1/"
   xmlns:cc="http://creativecommons.org/ns#"
   xmlns:rdf="http://www.w3.org/1999/02/22-rdf-syntax-ns#"
   xmlns:svg="http://www.w3.org/2000/svg"
   xmlns="http://www.w3.org/2000/svg"
   xmlns:sodipodi="http://sodipodi.sourceforge.net/DTD/sodipodi-0.dtd"
   xmlns:inkscape="http://www.inkscape.org/namespaces/inkscape"
   id="svg822"
   version="1.1"
   viewBox="0 0 1920 2160"
   height="2160mm"
   width="1920mm"
   sodipodi:docname="terreno-A.svg"
   inkscape:version="0.92.3 (2405546, 2018-03-11)">
  <sodipodi:namedview
     pagecolor="#ffffff"
     bordercolor="#666666"
     borderopacity="1"
     objecttolerance="10"
     gridtolerance="10"
     guidetolerance="10"
     inkscape:pageopacity="0"
     inkscape:pageshadow="2"
     inkscape:window-width="1858"
     inkscape:window-height="1177"
     id="namedview7"
     showgrid="false"
     inkscape:zoom="0.088388348"
     inkscape:cx="3355.4714"
     inkscape:cy="3358.0593"
     inkscape:window-x="-8"
     inkscape:window-y="-8"
     inkscape:window-maximized="1"
     inkscape:current-layer="svg822" />
  <defs
     id="defs816" />
  <metadata
     id="metadata819">
    <rdf:RDF>
      <cc:Work
         rdf:about="">
        <dc:format>image/svg+xml</dc:format>
        <dc:type
           rdf:resource="http://purl.org/dc/dcmitype/StillImage" />
        <dc:title></dc:title>
      </cc:Work>
    </rdf:RDF>
  </metadata>
  <g
     transform="matrix(0.99872304,0,0,1.0002639,2.4515423,1862.9219)"
     id="layer1"
     style="stroke:#000000;stroke-width:0;stroke-miterlimit:4;stroke-dasharray:none;stroke-opacity:1">
    <path
       id="path1381"
       d="M -2.2281643,-257.9352 C 75.997234,-168.46196 45.100395,85.447874 224.13104,75.523848 448.15911,70.711242 601.79446,30.479413 703.03572,5.202339 c 0,0 239.21761,-75.832983 327.24708,-68.591423 206.6089,16.996249 238.9059,10.631951 385.0918,52.787784 150.2789,43.33613 248.882,18.6145886 328.8041,-20.568226 100.7403,-66.939287 148.2142,-145.412274 175.8182,-211.067694 l -0.01,539.2389 -1922.3734751,0.0103 z"
       style="fill:#cd9600;fill-opacity:1;stroke:#000000;stroke-width:0;stroke-linecap:butt;stroke-linejoin:miter;stroke-miterlimit:4;stroke-dasharray:none;stroke-opacity:1"
       inkscape:connector-curvature="0"
       sodipodi:nodetypes="cccssccccc" />
  </g>
</svg>
