{
    "custom_transition": true,
    "state": 0,
    "trained_fixation_time": 0.6,
    "transitions_model": "0.122263 0.134941 0.49414 0.628065;0.824712 0.616264 0 0.24075;0 0.0831602 0.166392 0;0.0530254 0.165635 0.339468 0.131186;",
    "untrained_fixation_radius": 0.05,
    "untrained_fixation_time": 600
}
