{
  "index_name": "antora-docs",
  "start_urls": [
    {
      "url": "https://docs.antora.org/antora/(?P<version>.*?)/",
      "extra_attributes": {
        "component": "antora"
      },
      "variables": {
        "version": [
          "latest",
          "3.0"
        ]
      }
    },
    {
      "url": "https://docs.antora.org/antora/(?P<version>.*?)/whats-new/",
      "extra_attributes": {
        "component": "antora"
      },
      "selectors_key": "multipart",
      "variables": {
        "version": [
          "latest",
          "3.0"
        ]
      }
    },
    {
      "url": "https://docs.antora.org/gradle-plugin/(?P<version>.*?)/",
      "extra_attributes": {
        "component": "gradle-plugin"
      },
      "variables": {
        "version": [
          "latest"
        ]
      }
    },
    {
      "url": "https://docs.antora.org/(?P<component>.*?)/",
      "variables": {
        "component": [
          "antora-ui-default"
        ]
      },
      "selectors_key": "versionless"
    }
  ],
  "sitemap_urls": [
    "https://docs.antora.org/sitemap.xml"
  ],
  "scrape_start_urls": true,
  "stop_urls": [],
  "selectors": {
    "default": {
      "lvl0": {
        "global": true,
        "selector": ".nav-panel-explore .context .title, .nav-panel-explore .context .version"
      },
      "lvl1": ".doc > h1.page",
      "lvl2": ".doc .sect1 > h2:first-child",
      "lvl3": ".doc .sect2 > h3:first-child",
      "lvl4": ".doc .sect3 > h4:first-child",
      "lvl5": ".doc .sidebarblock > .content > .title",
      "text": ".doc p, .doc dt, .doc td.content, .doc th.tableblock"
    },
    "multipart": {
      "lvl0": {
        "global": true,
        "selector": ".nav-panel-explore .context .title, .nav-panel-explore .context .version"
      },
      "lvl1": ".doc > h1.page",
      "lvl2": ".doc > h1.sect0",
      "lvl3": ".doc .sect1 > h2:first-child",
      "lvl4": ".doc .sect2 > h3:first-child",
      "text": ".doc p, .doc dt, .doc td.content, .doc th.tableblock"
    },
    "versionless": {
      "lvl0": {
        "global": true,
        "selector": ".nav-panel-explore .context .title"
      },
      "lvl1": ".doc > h1.page",
      "lvl2": ".doc .sect1 > h2:first-child",
      "lvl3": ".doc .sect2 > h3:first-child",
      "lvl4": ".doc .sect3 > h4:first-child",
      "lvl5": ".doc .sidebarblock > .content > .title",
      "text": ".doc p, .doc dt, .doc td.content, .doc th.tableblock"
    }
  },
  "selectors_exclude": [],
  "min_indexed_level": 1,
  "custom_settings": {
    "advancedSyntax": true,
    "attributesForFaceting": [
      "component",
      "version"
    ],
    "attributesToRetrieve": [
      "anchor",
      "content",
      "hierarchy",
      "url",
      "component",
      "version"
    ],
    "attributesToSnippet": [
      "content:25"
    ],
    "customRanking": [
      "desc(weight.page_rank)",
      "desc(version)",
      "desc(weight.level)",
      "asc(weight.position)"
    ]
  }
}
