menuCollNom,menuCollSiret,menuEtablissementNom,menuEtablissementSiret,menuRestaurantNom,menuRestaurantInsee,menuRestaurantId,menuRestaurantIdType,menuRestaurantType,menuRestaurantConvive,menuDate,menuRepasType,menuPlatType,menuPlatNom,menuPlatCode,menuPlatSiqo,menuPlatLabel,menuPlatPrecision,menuPlatRegime,menuPlatAllergene,menuPlatTexture,menuPlatNutriscore,menuPlatPrix,menuPublicationDate,menuModificationDate,menuModificationInfo
métropole de Rennes,24350013900189,ville de Rennes,21350238800019,élémentaire Duchesse Anne,35238,21350238800024,SIRET,élémentaire,tous,2019-12-10,déjeuner,entrée,radis,349856,[],,,"[""sans sucre ajouté""]",[],"[""sans texture modifiée""]",A,0.6,2020-05-11T14:08:32Z,2020-05-11T14:08:32Z,création
métropole de Rennes,24350013900189,ville de Rennes,21350238800019,élémentaire Duchesse Anne,35238,21350238800024,SIRET,élémentaire,tous,2019-12-10,déjeuner,plat principal,goulash de bœuf,235698,"[""agriculture biologique""]",,,[],[],"[""sans texture modifiée"",""haché""]",C,1.23,2020-05-11T14:08:32Z,2020-05-11T14:08:32Z,création
métropole de Rennes,24350013900189,ville de Rennes,21350238800019,élémentaire Duchesse Anne,35238,21350238800024,SIRET,élémentaire,tous,2019-12-10,déjeuner,garniture,carottes ménagères,287643,"[""agriculture biologique""]",,,"[""végétarien""]",[],"[""mixé""]",B,0.89,2020-05-11T14:08:32Z,2020-05-11T14:08:32Z,création
métropole de Rennes,24350013900189,ville de Rennes,21350238800019,élémentaire Duchesse Anne,35238,21350238800024,SIRET,élémentaire,tous,2019-12-10,déjeuner,dessert,chou à la crème,985673,[],,,[],"[""céréales contenant du gluten""]","[""sans texture modifiée""]",E,1.12,2020-05-11T14:08:32Z,2020-05-11T14:08:32Z,création
métropole de Rennes,24350013900189,ville de Rennes,21350238800019,élémentaire Duchesse Anne,35238,21350238800024,SIRET,élémentaire,tous,2019-12-10,déjeuner,produit laitier,fromage,372322,[],,,[],[],"[""sans texture modifiée""]",D,0.76,2020-05-11T14:08:32Z,2020-05-11T14:08:32Z,création
métropole de Rennes,24350013900189,ville de Rennes,21350238800019,élémentaire Duchesse Anne,35238,21350238800024,SIRET,élémentaire,tous,2019-12-10,goûter,pain,pain -  confiture -  lait,112900,[],,,[],"[""lait"",""céréales contenant du gluten""]","[""sans texture modifiée""]",C,0.5,2020-05-11T14:08:32Z,2020-05-11T14:08:32Z,mise à jour
métropole de Rennes,24350013900189,ville de Rennes,21350238800019,maternelle Gantelles,35238,21350238800027,SIRET,maternelle,petite section,2019-12-17,déjeuner,entrée,carottes au citron,238738,"[""agriculture biologique""]",,,"[""végétarien""]",[],"[""sans texture modifiée""]",B,0.6,2020-05-11T14:08:32Z,2020-05-11T14:08:32Z,création
métropole de Rennes,24350013900189,ville de Rennes,21350238800019,maternelle Gantelles,35238,21350238800027,SIRET,maternelle,tous,2019-12-17,déjeuner,plat principal,sauté de porc ou sauté de dinde dijonnais,999765,[],,,[],[],"[""sans texture modifiée""]",C,1.3,2020-05-11T14:08:32Z,2020-05-11T14:08:32Z,création
métropole de Rennes,24350013900189,ville de Rennes,21350238800019,maternelle Gantelles,35238,21350238800027,SIRET,maternelle,tous,2019-12-17,déjeuner,garniture,haricots blancs,774453,"[""spécialité traditionnelle garantie""]",,,"[""végétarien""]",[],"[""sans texture modifiée""]",A,0.7,2020-05-11T14:08:32Z,2020-05-11T14:08:32Z,création
métropole de Rennes,24350013900189,ville de Rennes,21350238800019,maternelle Gantelles,35238,21350238800027,SIRET,maternelle,tous,2019-12-17,déjeuner,dessert,compote pomme -  framboise,197822,[],,,[],[],"[""sans texture modifiée""]",C,0.5,2020-05-11T14:08:32Z,2020-05-11T14:08:32Z,création
métropole de Rennes,24350013900189,ville de Rennes,21350238800019,maternelle Gantelles,35238,21350238800027,SIRET,maternelle,tous,2019-12-17,goûter,pain,pain beurre - barre chocolatée - lait,365444,"[""label rouge""]",,,[],"[""lait"",""céréales contenant du gluten""]","[""sans texture modifiée""]",C,0.5,2020-05-11T14:08:32Z,2020-05-11T14:08:32Z,création
métropole de Rennes,24350013900189,ville de Rennes,21350238800019,maternelle Quineleu,35238,21350238800037,SIRET,maternelle,tous,2019-12-17,déjeuner,entrée,mousse de canard sur toast – figuette et mâche,112290,[],,,[],[],"[""sans texture modifiée""]",D,0.89,2020-05-11T14:08:32Z,2020-05-11T14:08:32Z,création
métropole de Rennes,24350013900189,ville de Rennes,21350238800019,élémentaire Carle Bahon,35238,21350238800087,SIRET,élémentaire,tous,2019-12-20,déjeuner,entrée,"salade méli-mélo (carottes, céleri)",332322,[],,,"[""végétarien""]",[],"[""sans texture modifiée""]",B,0.9,2020-05-11T14:08:32Z,2020-05-11T14:08:32Z,création
métropole de Rennes,24350013900189,ville de Rennes,21350238800019,élémentaire Carle Bahon,35238,21350238800087,SIRET,élémentaire,tous,2019-12-20,déjeuner,plat principal,blanquette de dinde,982324,[],,,[],[],"[""sans texture modifiée""]",C,1.4,2020-05-11T14:08:32Z,2020-05-11T14:08:32Z,création
métropole de Rennes,24350013900189,ville de Rennes,21350238800019,élémentaire Carle Bahon,35238,21350238800087,SIRET,élémentaire,tous,2019-12-20,déjeuner,garniture,brocolis panachés,387333,[],,,"[""végétarien""]",[],"[""sans texture modifiée""]",A,0.6,2020-05-11T14:08:32Z,2020-05-11T14:08:32Z,création
métropole de Rennes,24350013900189,ville de Rennes,21350238800019,élémentaire Carle Bahon,35238,21350238800087,SIRET,élémentaire,tous,2019-12-20,déjeuner,dessert,crème au chocolat,322210,[],,,[],[],"[""sans texture modifiée""]",C,0.8,2020-05-11T14:08:32Z,2020-05-11T14:08:32Z,création
métropole de Rennes,24350013900189,ville de Rennes,21350238800019,élémentaire Carle Bahon,35238,21350238800087,SIRET,élémentaire,tous,2019-12-20,goûter,dessert,palet breton,112220,[],,,[],[],"[""sans texture modifiée""]",D,0.6,2020-05-11T14:08:32Z,2020-05-11T14:08:32Z,mise à jour rupture approvisionnement
métropole de Rennes,24350013900189,ville de Rennes,21350238800019,élémentaire Carle Bahon,35238,21350238800087,SIRET,élémentaire,petite section,2019-12-20,déjeuner,produit laitier,yaourt nature,896786,[],,,[],[],"[""sans texture modifiée""]",B,0.3,2020-05-11T14:08:32Z,2020-05-11T14:08:32Z,création
métropole de Rennes,24350013900189,ville de Rennes,21350238800019,maternelle Jean Moulin,35238,21350238800003,SIRET,maternelle,tous,2019-12-27,déjeuner,plat principal,gratin de boulgour,888843,[],,,"[""végétarien""]",[],"[""sans texture modifiée""]",B,0.66,2020-05-11T14:08:32Z,2020-05-11T14:08:32Z,création
métropole de Rennes,24350013900189,ville de Rennes,21350238800019,maternelle Jean Moulin,35238,21350238800003,SIRET,maternelle,tous,2019-12-27,déjeuner,garniture,salade verte,443222,[],,,"[""végétarien""]",[],"[""sans texture modifiée""]",A,0.23,2020-05-11T14:08:32Z,2020-05-11T14:08:32Z,création
métropole de Rennes,24350013900189,ville de Rennes,21350238800019,maternelle Jean Moulin,35238,21350238800003,SIRET,maternelle,tous,2019-12-27,déjeuner,dessert,fruit de saison,128977,[],,,[],[],"[""sans texture modifiée""]",A,0.7,2020-05-11T14:08:32Z,2020-05-11T14:08:32Z,création
métropole de Rennes,24350013900189,ville de Rennes,21350238800019,maternelle Jean Moulin,35238,21350238800003,SIRET,maternelle,tous,2019-12-27,déjeuner,pain,pain -  beurre -  barre chocolatée -  lait,393432,[],,,[],"[""lait"",""céréales contenant du gluten""]","[""sans texture modifiée""]",C,0.5,2020-05-11T14:08:32Z,2020-05-11T14:08:32Z,mise à jour
métropole de Rennes,24350013900189,ville de Rennes,21350238800019,maternelle Jean Moulin,35238,21350238800003,SIRET,maternelle,tous,2019-12-12,déjeuner,entrée,betteraves  -  cossettes,118944,[],,,"[""végétarien""]",[],"[""sans texture modifiée""]",B,0.6,2020-05-11T14:08:32Z,2020-05-11T14:08:32Z,création
métropole de Rennes,24350013900189,ville de Rennes,21350238800019,maternelle Henri Wallon,35238,21350238800011,SIRET,maternelle,tous,2019-12-12,déjeuner,plat principal,Dos de lieu sauce armoricaine,893446,[],,,[],[],"[""sans texture modifiée""]",B,1.1,2020-05-11T14:08:32Z,2020-05-11T14:08:32Z,création
métropole de Rennes,24350013900189,ville de Rennes,21350238800019,maternelle Henri Wallon,35238,21350238800011,SIRET,maternelle,tous,2019-12-12,déjeuner,garniture,riz créole,344632,[],,,"[""végétarien""]",[],"[""sans texture modifiée""]",B,0.8,2020-05-11T14:08:32Z,2020-05-11T14:08:32Z,création
métropole de Rennes,24350013900189,ville de Rennes,21350238800019,maternelle Henri Wallon,35238,21350238800011,SIRET,maternelle,tous,2019-12-12,déjeuner,dessert,fruit de saison,112782,[],,,"[""végétarien""]",[],"[""sans texture modifiée""]",A,0.8,2020-05-11T14:08:32Z,2020-05-11T14:08:32Z,création
métropole de Rennes,24350013900189,ville de Rennes,21350238800019,maternelle Henri Wallon,35238,21350238800011,SIRET,maternelle,tous,2019-12-12,goûter,pain,pain -  beurre -  corbeille de fruits -  lait ou fromage,894533,[],,,[],"[""céréales contenant du gluten""]","[""sans texture modifiée""]",C,0.5,2020-05-11T14:08:32Z,2020-05-11T14:08:32Z,mise à jour
métropole de Rennes,24350013900189,ville de Rennes,21350238800019,élémentaire Liberté,35238,21350238800001,SIRET,élémentaire,tous,2019-12-12,déjeuner,entrée,blé aux légumes,744352,[],,,"[""végétarien""]",[],"[""mixé""]",A,0.6,2020-05-11T14:08:32Z,2020-05-11T14:08:32Z,création
métropole de Rennes,24350013900189,ville de Rennes,21350238800019,élémentaire Liberté,35238,21350238800001,SIRET,élémentaire,tous,2019-12-24,déjeuner,plat principal,filet de lieu sauce crème,378973,[],,,[],[],"[""sans texture modifiée""]",C,1.1,2020-05-11T14:08:32Z,2020-05-11T14:08:32Z,création
métropole de Rennes,24350013900189,ville de Rennes,21350238800019,élémentaire Liberté,35238,21350238800001,SIRET,élémentaire,tous,2019-12-24,déjeuner,garniture,carottes ménagères,378933,"[""agriculture biologique""]",,,"[""végétarien""]",[],"[""sans texture modifiée""]",B,0.7,2020-05-11T14:08:32Z,2020-05-11T14:08:32Z,création
métropole de Rennes,24350013900189,ville de Rennes,21350238800019,élémentaire Liberté,35238,21350238800001,SIRET,élémentaire,tous,2019-12-24,déjeuner,dessert,prunes,987766,[],produit local,,"[""végétarien""]",[],"[""sans texture modifiée""]",A,0.43,2020-05-11T14:08:32Z,2020-05-11T14:08:32Z,création
métropole de Rennes,24350013900189,ville de Rennes,21350238800019,élémentaire Liberté,35238,21350238800001,SIRET,élémentaire,tous,2019-12-24,déjeuner,produit laitier,petits suisses,119035,[],,semaine helvétique,[],[],"[""sans texture modifiée""]",B,0.34,2020-05-11T14:08:32Z,2020-05-11T14:08:32Z,création
métropole de Rennes,24350013900189,ville de Rennes,21350238800019,élémentaire Liberté,35238,21350238800001,SIRET,élémentaire,tous,2019-12-24,goûter,pain,pain au lait -  jus de fruits,422221,[],,,[],"[""céréales contenant du gluten""]","[""sans texture modifiée""]",C,0.5,2020-05-11T14:08:32Z,2020-05-11T14:08:32Z,mise à jour
métropole de Rennes,24350013900189,ville de Rennes,21350238800019,maternelle Clemenceau,35238,21350238800090,SIRET,maternelle,tous,2019-12-27,déjeuner,entrée,chou rouge aux raisins,232323,[],,,"[""végétarien""]",[],"[""sans texture modifiée""]",B,0.6,2020-05-11T14:08:32Z,2020-05-11T14:08:32Z,création
métropole de Rennes,24350013900189,ville de Rennes,21350238800019,maternelle Clemenceau,35238,21350238800090,SIRET,maternelle,petite section,2019-12-27,déjeuner,plat principal,rôti de porc sauce tomate,789733,[],,,[],[],"[""sans texture modifiée""]",C,1.2,2020-05-11T14:08:32Z,2020-05-11T14:08:32Z,création
métropole de Rennes,24350013900189,ville de Rennes,21350238800019,maternelle Clemenceau,35238,21350238800090,SIRET,maternelle,tous,2019-12-27,déjeuner,garniture,carottes ménagères,897006,"[""agriculture biologique""]",,,"[""végétarien""]",[],"[""mixé""]",B,0.7,2020-05-11T14:08:32Z,2020-05-11T14:08:32Z,création
métropole de Rennes,24350013900189,ville de Rennes,21350238800019,maternelle Clemenceau,35238,21350238800090,SIRET,maternelle,tous,2019-12-27,déjeuner,produit laitier,semoule au lait,890873,[],,,[],[],"[""sans texture modifiée""]",B,0.6,2020-05-11T14:08:32Z,2020-05-11T14:08:32Z,création
métropole de Rennes,24350013900189,ville de Rennes,21350238800019,maternelle Clemenceau,35238,21350238800090,SIRET,maternelle,tous,2019-12-27,goûter,dessert,mini quatre-quarts/ cocktail de fruits/ lait,893333,[],,,[],"[""céréales contenant du gluten""]","[""sans texture modifiée""]",C,0.5,2020-05-11T14:08:32Z,2020-05-11T14:08:32Z,mise à jour
métropole de Rennes,24350013900189,ville de Rennes,21350238800019,élémentaire Champion de Cicé,35238,21350238800033,SIRET,élémentaire,tous,2019-12-12,déjeuner,entrée,chou rouge vinaigrette,322267,[],,,"[""végétarien""]",[],"[""sans texture modifiée""]",B,0.7,2020-05-11T14:08:32Z,2020-05-11T14:08:32Z,création
métropole de Rennes,24350013900189,ville de Rennes,21350238800019,élémentaire Champion de Cicé,35238,21350238800033,SIRET,élémentaire,tous,2019-12-12,déjeuner,plat principal,rôti de porc au jus,112223,"[""appellation d'origine protégée""]",,,[],[],"[""sans texture modifiée""]",C,1.12,2020-05-11T14:08:32Z,2020-05-11T14:08:32Z,création
métropole de Rennes,24350013900189,ville de Rennes,21350238800019,élémentaire Champion de Cicé,35238,21350238800033,SIRET,élémentaire,tous,2019-12-12,déjeuner,garniture,frites,984444,[],,semaine belge,[],[],"[""sans texture modifiée""]",D,0.99,2020-05-11T14:08:32Z,2020-05-11T14:08:32Z,création
métropole de Rennes,24350013900189,ville de Rennes,21350238800019,élémentaire Champion de Cicé,35238,21350238800033,SIRET,élémentaire,tous,2019-12-12,déjeuner,produit laitier,yaourt à l'abricot,674454,"[""agriculture biologique""]",Ferme des Jarouilles,,[],[],"[""sans texture modifiée""]",B,0.26,2020-05-11T14:08:32Z,2020-05-11T14:08:32Z,création
métropole de Rennes,24350013900189,ville de Rennes,21350238800019,élémentaire Champion de Cicé,35238,21350238800033,SIRET,élémentaire,tous,2019-12-12,goûter,pain,pain -  compote -  lait,893332,[],,,[],[],"[""sans texture modifiée""]",C,0.5,2020-05-11T14:08:32Z,2020-05-11T14:08:32Z,mise à jour
métropole de Rennes,24350013900189,ville de Rennes,21350238800019,élémentaire Louise Michel,35238,21350238800077,SIRET,élémentaire,tous,2019-12-12,déjeuner,entrée,salade de tomates -  maïs -  thon,438933,[],,,[],[],"[""sans texture modifiée""]",B,0.87,2020-05-11T14:08:32Z,2020-05-11T14:08:32Z,création
métropole de Rennes,24350013900189,ville de Rennes,21350238800019,élémentaire Louise Michel,35238,21350238800077,SIRET,élémentaire,tous,2019-12-12,déjeuner,plat principal,escalope de poulet,237822,[],,,[],[],"[""sans texture modifiée""]",C,1.2,2020-05-11T14:08:32Z,2020-05-11T14:08:32Z,création
métropole de Rennes,24350013900189,ville de Rennes,21350238800019,élémentaire Louise Michel,35238,21350238800077,SIRET,élémentaire,tous,2019-12-16,déjeuner,garniture,printanière de garniture,237823,[],,,"[""végétarien""]",[],"[""sans texture modifiée""]",B,0.34,2020-05-11T14:08:32Z,2020-05-11T14:08:32Z,création
métropole de Rennes,24350013900189,ville de Rennes,21350238800019,élémentaire Louise Michel,35238,21350238800077,SIRET,élémentaire,tous,2019-12-16,déjeuner,produit laitier,tomme des pyrénées,367833,"[""indication géographique protégée""]",,,"[""végétarien""]",[],"[""sans texture modifiée""]",C,0.69,2020-05-11T14:08:32Z,2020-05-11T14:08:32Z,création
métropole de Rennes,24350013900189,ville de Rennes,21350238800019,élémentaire Louise Michel,35238,21350238800077,SIRET,élémentaire,tous,2019-12-16,déjeuner,dessert,poire,984633,[],,,"[""végétarien""]",[],"[""sans texture modifiée""]",A,0.22,2020-05-11T14:08:32Z,2020-05-11T14:08:32Z,création
métropole de Rennes,24350013900189,ville de Rennes,21350238800019,élémentaire Louise Michel,35238,21350238800077,SIRET,élémentaire,tous,2019-12-16,goûter,dessert,madeleine -  lait,232323,[],,,[],"[""céréales contenant du gluten""]","[""sans texture modifiée""]",B,0.5,2020-05-11T14:08:32Z,2020-05-11T14:08:32Z,modification suite à problème de livraison
métropole de Rennes,24350013900189,ville de Rennes,21350238800019,maternelle Faux-pont,35238,21350238800088,SIRET,maternelle,tous,2019-12-16,déjeuner,entrée,salade de pâtes aux légumes,986743,[],,,"[""végétarien""]",[],"[""sans texture modifiée""]",B,0.97,2020-05-11T14:08:32Z,2020-05-11T14:08:32Z,création
métropole de Rennes,24350013900189,ville de Rennes,21350238800019,maternelle Faux-pont,35238,21350238800088,SIRET,maternelle,tous,2019-12-16,déjeuner,plat principal,escalope de porc sauce charcutière,232344,[],,,[],[],"[""sans texture modifiée""]",C,1.4,2020-05-11T14:08:32Z,2020-05-11T14:08:32Z,création
métropole de Rennes,24350013900189,ville de Rennes,21350238800019,maternelle Faux-pont,35238,21350238800088,SIRET,maternelle,tous,2019-12-27,déjeuner,garniture,carottes aux pruneaux,342329,[],,,"[""végétarien""]",[],"[""sans texture modifiée""]",B,0.78,2020-05-11T14:08:32Z,2020-05-11T14:08:32Z,création
métropole de Rennes,24350013900189,ville de Rennes,21350238800019,maternelle Faux-pont,35238,21350238800088,SIRET,maternelle,petite section,2019-12-27,déjeuner,dessert,kiwi,931189,[],,,"[""végétarien""]",[],"[""sans texture modifiée""]",A,0.33,2020-05-11T14:08:32Z,2020-05-11T14:08:32Z,création
métropole de Rennes,24350013900189,ville de Rennes,21350238800019,maternelle Faux-pont,35238,21350238800088,SIRET,maternelle,tous,2019-12-27,goûter,dessert,mini quatre-quarts -  cocktail de fruits -  lait,232378,[],,,[],[],"[""sans texture modifiée""]",C,0.5,2020-05-11T14:08:32Z,2020-05-11T14:08:32Z,modification suite à problème de livraison
métropole de Rennes,24350013900189,ville de Rennes,21350238800019,élémentaire Jacques prévert,35238,21350238800029,SIRET,élémentaire,tous,2019-12-27,déjeuner,entrée,pamplemousse,899994,[],,,"[""végétarien""]","[""céréales contenant du gluten""]","[""sans texture modifiée""]",A,0.21,2020-05-11T14:08:32Z,2020-05-11T14:08:32Z,création
métropole de Rennes,24350013900189,ville de Rennes,21350238800019,élémentaire Jacques prévert,35238,21350238800029,SIRET,élémentaire,tous,2019-12-27,déjeuner,plat principal,bœuf chasseur,899994,[],,,[],[],"[""mixé""]",D,1.54,2020-05-11T14:08:32Z,2020-05-11T14:08:32Z,création
métropole de Rennes,24350013900189,ville de Rennes,21350238800019,élémentaire Jacques prévert,35238,21350238800029,SIRET,élémentaire,tous,2019-12-27,déjeuner,garniture,haricots beurre,733978,[],,,"[""végétarien""]",[],"[""sans texture modifiée""]",B,0.54,2020-05-11T14:08:32Z,2020-05-11T14:08:32Z,création
métropole de Rennes,24350013900189,ville de Rennes,21350238800019,élémentaire Jacques prévert,35238,21350238800029,SIRET,élémentaire,tous,2019-12-12,déjeuner,dessert,banane,323789,[],,,"[""végétarien""]",[],"[""sans texture modifiée""]",A,0.34,2020-05-11T14:08:32Z,2020-05-11T14:08:32Z,création
métropole de Rennes,24350013900189,ville de Rennes,21350238800019,élémentaire Jacques prévert,35238,21350238800029,SIRET,élémentaire,tous,2019-12-12,goûter,pain,pain -  beurre -  corbeille de fruits -  lait ou fromage,744544,[],,,[],[],"[""sans texture modifiée""]",C,0.5,2020-05-11T14:08:32Z,2020-05-11T14:08:32Z,mise à jour
Communauté Urbaine Grand Poitiers,20006985400012,ville de Poitiers,21860194600013,Restaurant Andersen,86194,R1,autre,maternelle,tous,2020-01-04,déjeuner,entrée,pomelos,444783,"[""agriculture biologique""]",,,[],[],"[""sans texture modifiée""]",A,0.23,2020-12-30T03:01:15Z,2020-12-30T03:01:15Z,création
Communauté Urbaine Grand Poitiers,20006985400012,ville de Poitiers,21860194600013,Restaurant Andersen,86194,R1,autre,maternelle,tous,2020-01-04,déjeuner,plat principal,filet de poulet et sa sauce suprême,p02,[],,,[],[],"[""sans texture modifiée""]",D,1.34,2020-12-30T03:01:15Z,2020-12-30T03:01:15Z,création
Communauté Urbaine Grand Poitiers,20006985400012,ville de Poitiers,21860194600013,Restaurant Andersen,86194,R1,autre,maternelle,tous,2020-01-04,déjeuner,garniture,coquillettes,p03,[],,,[],[],"[""sans texture modifiée""]",B,0.54,2020-12-30T03:01:15Z,2020-12-30T03:01:15Z,création
Communauté Urbaine Grand Poitiers,20006985400012,ville de Poitiers,21860194600013,Restaurant Andersen,86194,R1,autre,maternelle,tous,2020-01-04,déjeuner,produit laitier,saint Nectaire,p04,[],,,[],[],"[""sans texture modifiée""]",C,0.63,2020-12-30T03:01:15Z,2020-12-30T03:01:15Z,création
Communauté Urbaine Grand Poitiers,20006985400012,ville de Poitiers,21860194600013,Restaurant Andersen,86194,R1,autre,maternelle,tous,2020-01-04,déjeuner,dessert,pruneaux au sirop,p05,[],,,[],[],"[""sans texture modifiée""]",B,0.78,2020-12-30T03:01:15Z,2020-12-30T03:01:15Z,création
Communauté Urbaine Grand Poitiers,20006985400012,ville de Poitiers,21860194600013,Restaurant Andersen,86194,R1,autre,maternelle,tous,2020-01-04,goûter,produit laitier,lait,p06,[],,,[],[],"[""sans texture modifiée""]",B,0.21,2020-12-30T03:01:15Z,2020-12-30T03:01:15Z,création
Communauté Urbaine Grand Poitiers,20006985400012,ville de Poitiers,21860194600013,Restaurant Andersen,86194,R1,autre,maternelle,tous,2020-01-04,goûter,dessert,kiwi,p07,[],,,[],[],"[""sans texture modifiée""]",A,0.18,2020-12-30T03:01:15Z,2020-12-30T03:01:15Z,création
Communauté Urbaine Grand Poitiers,20006985400012,ville de Poitiers,21860194600013,Restaurant Andersen,86194,R1,autre,maternelle,tous,2020-01-04,goûter,dessert,sablé de retz,p08,[],,,[],[],"[""sans texture modifiée""]",C,0.38,2020-12-30T03:01:15Z,2020-12-30T03:01:15Z,création
Communauté Urbaine Grand Poitiers,20006985400012,ville de Poitiers,21860194600013,Restaurant Andersen,86194,R1,autre,maternelle,tous,2020-01-05,déjeuner,entrée,velouté de tomate et basilic,p09,"[""agriculture biologique""]",,,[],[],"[""sans texture modifiée""]",B,0.74,2020-12-30T03:01:15Z,2020-12-30T03:01:15Z,création
Communauté Urbaine Grand Poitiers,20006985400012,ville de Poitiers,21860194600013,Restaurant Andersen,86194,R1,autre,maternelle,tous,2020-01-05,déjeuner,plat principal,"galette de boulgour, pois chiche, émmental à l'orientale",p10,[],,,[],[],"[""sans texture modifiée""]",C,0.84,2020-12-30T03:01:15Z,2020-12-30T03:01:15Z,création
Communauté Urbaine Grand Poitiers,20006985400012,ville de Poitiers,21860194600013,Restaurant Andersen,86194,R1,autre,maternelle,tous,2020-01-05,déjeuner,garniture,cotes de blettes provencales,p11,"[""agriculture biologique""]",,semaine végétarienne,[],[],"[""mixé""]",B,0.64,2020-12-30T03:01:15Z,2020-12-30T03:01:15Z,création
Communauté Urbaine Grand Poitiers,20006985400012,ville de Poitiers,21860194600013,Restaurant Andersen,86194,R1,autre,maternelle,tous,2020-01-05,déjeuner,produit laitier,tomme de bournette,p12,"[""indication géographique protégée""]",,,[],[],"[""sans texture modifiée""]",C,0.76,2020-12-30T03:01:15Z,2020-12-30T03:01:15Z,création
Communauté Urbaine Grand Poitiers,20006985400012,ville de Poitiers,21860194600013,Restaurant Andersen,86194,R1,autre,maternelle,tous,2020-01-05,déjeuner,dessert,pomme,p13,"[""agriculture biologique""]",,,[],[],"[""sans texture modifiée""]",A,0.12,2020-12-30T03:01:15Z,2020-12-30T03:01:15Z,création
Communauté Urbaine Grand Poitiers,20006985400012,ville de Poitiers,21860194600013,Restaurant Andersen,86194,R1,autre,maternelle,tous,2020-01-05,goûter,produit laitier,lait,p06,[],,,[],[],"[""sans texture modifiée""]",B,0.21,2020-12-30T03:01:15Z,2020-12-30T03:01:15Z,création
Communauté Urbaine Grand Poitiers,20006985400012,ville de Poitiers,21860194600013,Restaurant Andersen,86194,R1,autre,maternelle,petite section,2020-01-05,goûter,dessert,confiture d'orange,p14,[],,,[],[],"[""sans texture modifiée""]",C,0.67,2020-12-30T03:01:15Z,2020-12-30T03:01:15Z,création
Communauté Urbaine Grand Poitiers,20006985400012,ville de Poitiers,21860194600013,Restaurant Andersen,86194,R1,autre,maternelle,tous,2020-01-05,goûter,pain,pain ,p15,[],,,[],"[""céréales contenant du gluten""]","[""sans texture modifiée""]",B,0.3,2020-12-30T03:01:15Z,2020-12-30T03:01:15Z,création
Communauté Urbaine Grand Poitiers,20006985400012,ville de Poitiers,21860194600013,Restaurant Andersen,86194,R1,autre,maternelle,tous,2020-01-06,déjeuner,entrée,macédoine vinaigrette,p16,[],,,[],[],"[""sans texture modifiée""]",C,0.62,2020-12-31T03:02:50Z,2020-12-31T03:02:50Z,création
Communauté Urbaine Grand Poitiers,20006985400012,ville de Poitiers,21860194600013,Restaurant Andersen,86194,R1,autre,maternelle,tous,2020-01-06,déjeuner,plat principal,gigot d'agneau et sa sauce menthe,p17,[],,semaine anglaise,[],[],"[""mixé""]",D,1.23,2020-12-31T03:02:50Z,2020-12-31T03:02:50Z,création
Communauté Urbaine Grand Poitiers,20006985400012,ville de Poitiers,21860194600013,Restaurant Andersen,86194,R1,autre,maternelle,tous,2020-01-06,déjeuner,garniture,flageolets,p18,"[""agriculture biologique""]",,,[],[],"[""sans texture modifiée""]",A,0.34,2020-12-31T03:02:50Z,2020-12-31T03:02:50Z,création
Communauté Urbaine Grand Poitiers,20006985400012,ville de Poitiers,21860194600013,Restaurant Andersen,86194,R1,autre,maternelle,tous,2020-01-06,déjeuner,produit laitier,tomme de montagne,p21,"[""indication géographique protégée""]",,,[],[],"[""sans texture modifiée""]",C,0.77,2020-12-31T11:22:13Z,2020-12-31T11:22:13Z,Erreur de livraison
Communauté Urbaine Grand Poitiers,20006985400012,ville de Poitiers,21860194600013,Restaurant Andersen,86194,R1,autre,maternelle,tous,2020-01-06,déjeuner,dessert,clémentine,p20,"[""agriculture biologique""]",,,[],[],"[""sans texture modifiée""]",A,0.32,2020-12-31T03:02:50Z,2020-12-31T03:02:50Z,création
Communauté Urbaine Grand Poitiers,20006985400012,ville de Poitiers,21860194600013,Restaurant Andersen,86194,R1,autre,élémentaire,tous,2020-01-04,déjeuner,entrée,pomelos,p01,"[""agriculture biologique""]",,,[],[],"[""sans texture modifiée""]",A,0.23,2020-12-30T03:01:15Z,2020-12-30T03:01:15Z,création
Communauté Urbaine Grand Poitiers,20006985400012,ville de Poitiers,21860194600013,Restaurant Andersen,86194,R1,autre,élémentaire,tous,2020-01-04,déjeuner,plat principal,filet de poulet et sa sauce suprême,p02,[],,,[],[],"[""sans texture modifiée""]",D,1.34,2020-12-30T03:01:15Z,2020-12-30T03:01:15Z,création
Communauté Urbaine Grand Poitiers,20006985400012,ville de Poitiers,21860194600013,Restaurant Andersen,86194,R1,autre,élémentaire,tous,2020-01-04,déjeuner,garniture,coquillettes,p03,[],,,[],[],"[""sans texture modifiée""]",,0.54,2020-12-30T03:01:15Z,2020-12-30T03:01:15Z,création
Communauté Urbaine Grand Poitiers,20006985400012,ville de Poitiers,21860194600013,Restaurant Andersen,86194,R1,autre,élémentaire,tous,2020-01-04,déjeuner,produit laitier,saint Nectaire,p04,"[""indication géographique protégée""]",,,[],[],"[""sans texture modifiée""]",B,0.63,2020-12-30T03:01:15Z,2020-12-30T03:01:15Z,création
Communauté Urbaine Grand Poitiers,20006985400012,ville de Poitiers,21860194600013,Restaurant Andersen,86194,R1,autre,élémentaire,tous,2020-01-04,déjeuner,dessert,pruneaux au sirop,p05,[],,,[],[],"[""sans texture modifiée""]",C,0.78,2020-12-30T03:01:15Z,2020-12-30T03:01:15Z,création
Communauté Urbaine Grand Poitiers,20006985400012,ville de Poitiers,21860194600013,Restaurant Andersen,86194,R1,autre,élémentaire,tous,2020-01-04,goûter,produit laitier,lait,p06,[],,,[],[],"[""sans texture modifiée""]",B,0.21,2020-12-30T03:01:15Z,2020-12-30T03:01:15Z,création
Communauté Urbaine Grand Poitiers,20006985400012,ville de Poitiers,21860194600013,Restaurant Andersen,86194,R1,autre,élémentaire,tous,2020-01-04,goûter,dessert,kiwi,p07,[],,,[],[],"[""sans texture modifiée""]",B,0.18,2020-12-30T03:01:15Z,2020-12-30T03:01:15Z,création
Communauté Urbaine Grand Poitiers,20006985400012,ville de Poitiers,21860194600013,Restaurant Andersen,86194,R1,autre,élémentaire,tous,2020-01-04,goûter,dessert,sablé de retz,p08,[],,,[],"[""céréales contenant du gluten""]","[""sans texture modifiée""]",A,0.38,2020-12-31T03:02:50Z,2020-12-31T03:02:50Z,création
Communauté Urbaine Grand Poitiers,20006985400012,ville de Poitiers,21860194600013,Restaurant Andersen,86194,R1,autre,élémentaire,tous,2020-01-05,déjeuner,entrée,velouté de tomate et basilic,p09,[],,,[],[],"[""sans texture modifiée""]",C,0.74,2020-12-30T03:01:15Z,2020-12-30T03:01:15Z,création
Communauté Urbaine Grand Poitiers,20006985400012,ville de Poitiers,21860194600013,Restaurant Andersen,86194,R1,autre,élémentaire,tous,2020-01-05,déjeuner,plat principal,"galette de boulgour, pois chiche, émmental à l'orientale",p10,[],,,[],[],"[""sans texture modifiée""]",B,0.84,2020-12-30T03:01:15Z,2020-12-30T03:01:15Z,création
Communauté Urbaine Grand Poitiers,20006985400012,ville de Poitiers,21860194600013,Restaurant Andersen,86194,R1,autre,élémentaire,tous,2020-01-05,déjeuner,garniture,cotes de blettes provencales,p11,[],,,[],[],"[""sans texture modifiée""]",C,0.64,2020-12-30T03:01:15Z,2020-12-30T03:01:15Z,création
Communauté Urbaine Grand Poitiers,20006985400012,ville de Poitiers,21860194600013,Restaurant Andersen,86194,R1,autre,élémentaire,tous,2020-01-05,déjeuner,produit laitier,tomme de bournette,p12,"[""indication géographique protégée""]",,,[],[],"[""sans texture modifiée""]",B,0.76,2020-12-30T03:01:15Z,2020-12-30T03:01:15Z,création
Communauté Urbaine Grand Poitiers,20006985400012,ville de Poitiers,21860194600013,Restaurant Andersen,86194,R1,autre,élémentaire,tous,2020-01-05,déjeuner,dessert,pomme,p13,[],,,[],[],"[""sans texture modifiée""]",C,0.2,2020-12-30T03:01:15Z,2020-12-30T03:01:15Z,création
Communauté Urbaine Grand Poitiers,20006985400012,ville de Poitiers,21860194600013,Restaurant Andersen,86194,R1,autre,élémentaire,tous,2020-01-05,goûter,produit laitier,lait,p06,[],,,[],"[""lait""]","[""sans texture modifiée""]",A,0.21,2020-12-30T03:01:15Z,2020-12-30T03:01:15Z,création
Communauté Urbaine Grand Poitiers,20006985400012,ville de Poitiers,21860194600013,Restaurant Andersen,86194,R1,autre,élémentaire,tous,2020-01-05,goûter,dessert,confiture d'orange,p14,[],,,[],[],"[""sans texture modifiée""]",B,0.67,2020-12-30T03:01:15Z,2020-12-30T03:01:15Z,création
Communauté Urbaine Grand Poitiers,20006985400012,ville de Poitiers,21860194600013,Restaurant Andersen,86194,R1,autre,élémentaire,tous,2020-01-05,goûter,dessert,pain ,p15,[],,,[],"[""céréales contenant du gluten""]","[""sans texture modifiée""]",C,0.3,2020-12-30T03:01:15Z,2020-12-30T03:01:15Z,création
Communauté Urbaine Grand Poitiers,20006985400012,ville de Poitiers,21860194600013,Restaurant Andersen,86194,R1,autre,élémentaire,tous,2020-01-06,déjeuner,entrée,macédoine vinaigrette,p16,[],,semaine balkans,[],[],"[""sans texture modifiée""]",B,0.61,2020-12-31T03:02:50Z,2020-12-31T03:02:50Z,création
Communauté Urbaine Grand Poitiers,20006985400012,ville de Poitiers,21860194600013,Restaurant Andersen,86194,R1,autre,élémentaire,tous,2020-01-06,déjeuner,plat principal,gigot d'agneau et sa sauce menthe,p17,[],,,[],[],"[""sans texture modifiée""]",C,1.23,2020-12-31T03:02:50Z,2020-12-31T03:02:50Z,création
Communauté Urbaine Grand Poitiers,20006985400012,ville de Poitiers,21860194600013,Restaurant Andersen,86194,R1,autre,élémentaire,tous,2020-01-06,déjeuner,garniture,flageolets,p18,[],,,[],[],"[""sans texture modifiée""]",D,0.34,2020-12-31T03:02:50Z,2020-12-31T03:02:50Z,création
Communauté Urbaine Grand Poitiers,20006985400012,ville de Poitiers,21860194600013,Restaurant Andersen,86194,R1,autre,élémentaire,tous,2020-01-06,déjeuner,produit laitier,tomme de montagne,p21,[],,,[],[],"[""sans texture modifiée""]",A,0.77,2020-12-31 11:22:13,2020-12-31 11:22:13,Erreur de livraison
Communauté Urbaine Grand Poitiers,20006985400012,ville de Poitiers,21860194600013,Restaurant Andersen,86194,R1,autre,élémentaire,tous,2020-01-06,déjeuner,dessert,clémentine,p20,"[""agriculture biologique""]",,,[],[],"[""sans texture modifiée""]",C,0.32,2020-12-31T03:02:50Z,2020-12-31T03:02:50Z,création
Communauté Urbaine Grand Poitiers,20006985400012,ville de Poitiers,21860194600013,Restaurant Andersen,86194,R1,autre,élémentaire,tous,2020-01-06,goûter,produit laitier,lait,p06,"[""agriculture biologique""]",,,[],"[""lait""]","[""sans texture modifiée""]",A,0.23,2020-12-31T11:22:13Z,2020-12-31T11:22:13Z,ajout d'un goûter exceptionnel
Communauté Urbaine Grand Poitiers,20006985400012,ville de Poitiers,21860194600013,Restaurant Andersen,86194,R1,autre,élémentaire,tous,2020-01-06,goûter,dessert,chocolat au lait,p21,[],,,[],"[""lait""]","[""sans texture modifiée""]",B,1.34,2020-12-31T11:22:13Z,2020-12-31T11:22:13Z,ajout d'un goûter exceptionnel
Communauté Urbaine Grand Poitiers,20006985400012,ville de Poitiers,21860194600013,Restaurant Andersen,86194,R1,autre,élémentaire,tous,2020-01-06,goûter,pain,pain,p08,[],,,[],"[""céréales contenant du gluten""]","[""sans texture modifiée""]",C,0.54,2020-12-31T11:22:13Z,2020-12-31T11:22:13Z,ajout d'un goûter exceptionnel
Communauté Urbaine Grand Poitiers,20006985400012,ville de Poitiers,21860194600013,Restaurant Condorcet,86194,R2,autre,maternelle,tous,2020-01-04,déjeuner,entrée,pomelos,p01,[],,,[],[],"[""sans texture modifiée""]",B,0.63,2020-12-30T03:01:15Z,2020-12-30T03:01:15Z,création
Communauté Urbaine Grand Poitiers,20006985400012,ville de Poitiers,21860194600013,Restaurant Condorcet,86194,R2,autre,maternelle,tous,2020-01-04,déjeuner,plat principal,filet de poulet et sa sauce suprême,p02,[],,,[],[],"[""sans texture modifiée""]",D,0.78,2020-12-30T03:01:15Z,2020-12-30T03:01:15Z,création
Communauté Urbaine Grand Poitiers,20006985400012,ville de Poitiers,21860194600013,Restaurant Condorcet,86194,R2,autre,maternelle,tous,2020-01-04,déjeuner,garniture,coquillettes,p03,[],,,[],[],"[""sans texture modifiée""]",B,0.54,2020-12-30T03:01:15Z,2020-12-30T03:01:15Z,création
Communauté Urbaine Grand Poitiers,20006985400012,ville de Poitiers,21860194600013,Restaurant Condorcet,86194,R2,autre,maternelle,tous,2020-01-04,déjeuner,produit laitier,saint Nectaire,p04,"[""indication géographique protégée""]",,,[],[],"[""sans texture modifiée""]",C,0.63,2020-12-30T03:01:15Z,2020-12-30T03:01:15Z,création
Communauté Urbaine Grand Poitiers,20006985400012,ville de Poitiers,21860194600013,Restaurant Condorcet,86194,R2,autre,maternelle,tous,2020-01-04,déjeuner,dessert,pruneaux au sirop,p05,[],,,[],[],"[""sans texture modifiée""]",B,0.78,2020-12-30T03:01:15Z,2020-12-30T03:01:15Z,création
Communauté Urbaine Grand Poitiers,20006985400012,ville de Poitiers,21860194600013,Restaurant Condorcet,86194,R2,autre,maternelle,tous,2020-01-04,goûter,produit laitier,lait,p06,"[""agriculture biologique""]",,,[],"[""lait""]","[""sans texture modifiée""]",B,0.21,2020-12-30T03:01:15Z,2020-12-30T03:01:15Z,création
Communauté Urbaine Grand Poitiers,20006985400012,ville de Poitiers,21860194600013,Restaurant Condorcet,86194,R2,autre,maternelle,tous,2020-01-04,goûter,dessert,kiwi,p07,[],,,[],[],"[""sans texture modifiée""]",A,0.18,2020-12-30T03:01:15Z,2020-12-30T03:01:15Z,création
Communauté Urbaine Grand Poitiers,20006985400012,ville de Poitiers,21860194600013,Restaurant Condorcet,86194,R2,autre,maternelle,tous,2020-01-04,goûter,dessert,sablé de retz,p08,[],,,[],[],"[""sans texture modifiée""]",C,0.38,2020-12-30T03:01:15Z,2020-12-30T03:01:15Z,création
Communauté Urbaine Grand Poitiers,20006985400012,ville de Poitiers,21860194600013,Restaurant Condorcet,86194,R2,autre,maternelle,tous,2020-01-05,déjeuner,entrée,velouté de tomate et basilic,p09,"[""agriculture biologique""]",,,[],[],"[""sans texture modifiée""]",B,0.74,2020-12-30T03:01:15Z,2020-12-30T03:01:15Z,création
Communauté Urbaine Grand Poitiers,20006985400012,ville de Poitiers,21860194600013,Restaurant Condorcet,86194,R2,autre,maternelle,tous,2020-01-05,déjeuner,plat principal,"galette de boulgour, pois chiche, émmental à l'orientale",p10,[],,,[],"[""céréales contenant du gluten""]","[""sans texture modifiée""]",C,0.84,2020-12-30T03:01:15Z,2020-12-30T03:01:15Z,création
Communauté Urbaine Grand Poitiers,20006985400012,ville de Poitiers,21860194600013,Restaurant Condorcet,86194,R2,autre,maternelle,tous,2020-01-05,déjeuner,garniture,cotes de blettes provencales,p11,"[""agriculture biologique""]",,,[],[],"[""sans texture modifiée""]",B,0.64,2020-12-30T03:01:15Z,2020-12-30T03:01:15Z,création
Communauté Urbaine Grand Poitiers,20006985400012,ville de Poitiers,21860194600013,Restaurant Condorcet,86194,R2,autre,maternelle,tous,2020-01-05,déjeuner,produit laitier,tomme de bournette,p12,"[""indication géographique protégée""]",,,[],[],"[""sans texture modifiée""]",C,0.76,2020-12-30T03:01:15Z,2020-12-30T03:01:15Z,création
Communauté Urbaine Grand Poitiers,20006985400012,ville de Poitiers,21860194600013,Restaurant Condorcet,86194,R2,autre,maternelle,tous,2020-01-05,déjeuner,dessert,pomme,p13,[],,,[],[],"[""sans texture modifiée""]",A,0.2,2020-12-30T03:01:15Z,2020-12-30T03:01:15Z,création
Communauté Urbaine Grand Poitiers,20006985400012,ville de Poitiers,21860194600013,Restaurant Condorcet,86194,R2,autre,maternelle,petite section,2020-01-05,goûter,produit laitier,lait,p06,"[""agriculture biologique""]",,,[],"[""lait""]","[""sans texture modifiée""]",B,0.21,2020-12-30T03:01:15Z,2020-12-30T03:01:15Z,création
Communauté Urbaine Grand Poitiers,20006985400012,ville de Poitiers,21860194600013,Restaurant Condorcet,86194,R2,autre,maternelle,tous,2020-01-05,goûter,dessert,confiture d'orange,p14,[],,,[],[],"[""sans texture modifiée""]",C,0.67,2020-12-30T03:01:15Z,2020-12-30T03:01:15Z,création
Communauté Urbaine Grand Poitiers,20006985400012,ville de Poitiers,21860194600013,Restaurant Condorcet,86194,R2,autre,maternelle,tous,2020-01-05,goûter,dessert,pain ,p15,[],,,[],"[""céréales contenant du gluten""]","[""sans texture modifiée""]",B,0.3,2020-12-30T03:01:15Z,2020-12-30T03:01:15Z,création
Communauté Urbaine Grand Poitiers,20006985400012,ville de Poitiers,21860194600013,Restaurant Condorcet,86194,R2,autre,maternelle,tous,2020-01-06,déjeuner,entrée,null,,[],,,[],[],"[""sans texture modifiée""]",,,2020-12-31T11:22:13Z,2020-12-31T11:22:13Z,classes fermées (dispositif  CoVid-19)
Communauté Urbaine Grand Poitiers,20006985400012,ville de Poitiers,21860194600013,Restaurant Condorcet,86194,R2,autre,maternelle,tous,2020-01-06,déjeuner,plat principal,null,,[],,,[],[],"[""sans texture modifiée""]",,,2020-12-31T11:22:13Z,2020-12-31T11:22:13Z,classes fermées (dispositif  CoVid-19)
Communauté Urbaine Grand Poitiers,20006985400012,ville de Poitiers,21860194600013,Restaurant Condorcet,86194,R2,autre,maternelle,tous,2020-01-06,déjeuner,garniture,null,,[],,,[],[],"[""sans texture modifiée""]",,,2020-12-31T11:22:13Z,2020-12-31T11:22:13Z,classes fermées (dispositif  CoVid-19)
Communauté Urbaine Grand Poitiers,20006985400012,ville de Poitiers,21860194600013,Restaurant Condorcet,86194,R2,autre,maternelle,tous,2020-01-06,déjeuner,produit laitier,null,,[],,,[],[],"[""sans texture modifiée""]",,,2020-12-31T11:22:13Z,2020-12-31T11:22:13Z,classes fermées (dispositif  CoVid-19)
Communauté Urbaine Grand Poitiers,20006985400012,ville de Poitiers,21860194600013,Restaurant Condorcet,86194,R2,autre,maternelle,tous,2020-01-06,déjeuner,dessert,null,,[],,,[],[],"[""sans texture modifiée""]",,,2020-12-31T11:22:13Z,2020-12-31T11:22:13Z,classes fermées (dispositif  CoVid-19)
Communauté Urbaine Grand Poitiers,20006985400012,ville de Poitiers,21860194600013,Restaurant Condorcet,86194,R2,autre,élémentaire,tous,2020-01-04,déjeuner,entrée,pomelos,p01,"[""agriculture biologique""]",,,[],[],"[""sans texture modifiée""]",A,0.63,2020-12-30T03:01:15Z,2020-12-30T03:01:15Z,création
Communauté Urbaine Grand Poitiers,20006985400012,ville de Poitiers,21860194600013,Restaurant Condorcet,86194,R2,autre,élémentaire,tous,2020-01-04,déjeuner,plat principal,filet de poulet et sa sauce suprême,p02,[],,,[],[],"[""sans texture modifiée""]",D,0.78,2020-12-30T03:01:15Z,2020-12-30T03:01:15Z,création
Communauté Urbaine Grand Poitiers,20006985400012,ville de Poitiers,21860194600013,Restaurant Condorcet,86194,R2,autre,élémentaire,tous,2020-01-04,déjeuner,garniture,coquillettes,p03,[],,,[],[],"[""sans texture modifiée""]",B,0.54,2020-12-30T03:01:15Z,2020-12-30T03:01:15Z,création
Communauté Urbaine Grand Poitiers,20006985400012,ville de Poitiers,21860194600013,Restaurant Condorcet,86194,R2,autre,élémentaire,tous,2020-01-04,déjeuner,produit laitier,saint Nectaire,p04,"[""indication géographique protégée""]",,,[],[],"[""sans texture modifiée""]",C,0.63,2020-12-30T03:01:15Z,2020-12-30T03:01:15Z,création
Communauté Urbaine Grand Poitiers,20006985400012,ville de Poitiers,21860194600013,Restaurant Condorcet,86194,R2,autre,élémentaire,tous,2020-01-04,déjeuner,dessert,pruneaux au sirop,p05,[],,,[],[],"[""sans texture modifiée""]",B,0.78,2020-12-30T03:01:15Z,2020-12-30T03:01:15Z,création
Communauté Urbaine Grand Poitiers,20006985400012,ville de Poitiers,21860194600013,Restaurant Condorcet,86194,R2,autre,élémentaire,tous,2020-01-04,goûter,produit laitier,lait,p06,"[""agriculture biologique""]",,,[],"[""lait""]","[""sans texture modifiée""]",B,0.21,2020-12-30T03:01:15Z,2020-12-30T03:01:15Z,création
Communauté Urbaine Grand Poitiers,20006985400012,ville de Poitiers,21860194600013,Restaurant Condorcet,86194,R2,autre,élémentaire,tous,2020-01-04,goûter,dessert,kiwi,p07,[],,,[],[],"[""sans texture modifiée""]",A,0.18,2020-12-30T03:01:15Z,2020-12-30T03:01:15Z,création
Communauté Urbaine Grand Poitiers,20006985400012,ville de Poitiers,21860194600013,Restaurant Condorcet,86194,R2,autre,élémentaire,tous,2020-01-04,goûter,dessert,sablé de retz,p08,[],,,[],[],"[""sans texture modifiée""]",C,0.38,2020-12-30T03:01:15Z,2020-12-30T03:01:15Z,création
Communauté Urbaine Grand Poitiers,20006985400012,ville de Poitiers,21860194600013,Restaurant Condorcet,86194,R2,autre,élémentaire,tous,2020-01-05,déjeuner,entrée,velouté de tomate et basilic,p09,[],,,[],[],"[""sans texture modifiée""]",B,0.74,2020-12-30T03:01:15Z,2020-12-30T03:01:15Z,création
Communauté Urbaine Grand Poitiers,20006985400012,ville de Poitiers,21860194600013,Restaurant Condorcet,86194,R2,autre,élémentaire,tous,2020-01-05,déjeuner,plat principal,"galette de boulgour, pois chiche, émmental à l'orientale",p10,[],,,[],"[""céréales contenant du gluten""]","[""sans texture modifiée""]",C,0.84,2020-12-30T03:01:15Z,2020-12-30T03:01:15Z,création
Communauté Urbaine Grand Poitiers,20006985400012,ville de Poitiers,21860194600013,Restaurant Condorcet,86194,R2,autre,élémentaire,tous,2020-01-05,déjeuner,garniture,cotes de blettes provencales,p11,"[""agriculture biologique""]",,,[],[],"[""sans texture modifiée""]",B,0.64,2020-12-30T03:01:15Z,2020-12-30T03:01:15Z,création
Communauté Urbaine Grand Poitiers,20006985400012,ville de Poitiers,21860194600013,Restaurant Condorcet,86194,R2,autre,élémentaire,tous,2020-01-05,déjeuner,produit laitier,tomme de bournette,p12,"[""agriculture biologique""]",,,[],[],"[""sans texture modifiée""]",C,0.76,2020-12-30T03:01:15Z,2020-12-30T03:01:15Z,création
Communauté Urbaine Grand Poitiers,20006985400012,ville de Poitiers,21860194600013,Restaurant Condorcet,86194,R2,autre,élémentaire,tous,2020-01-05,déjeuner,dessert,pomme,p13,"[""agriculture biologique""]",,,[],[],"[""sans texture modifiée""]",A,0.2,2020-12-30T03:01:15Z,2020-12-30T03:01:15Z,création
Communauté Urbaine Grand Poitiers,20006985400012,ville de Poitiers,21860194600013,Restaurant Condorcet,86194,R2,autre,élémentaire,tous,2020-01-05,goûter,produit laitier,lait,p06,[],,,[],"[""lait""]","[""sans texture modifiée""]",B,0.21,2020-12-30T03:01:15Z,2020-12-30T03:01:15Z,création
Communauté Urbaine Grand Poitiers,20006985400012,ville de Poitiers,21860194600013,Restaurant Condorcet,86194,R2,autre,élémentaire,tous,2020-01-05,goûter,dessert,confiture d'orange,p14,[],,,[],[],"[""sans texture modifiée""]",C,0.67,2020-12-30T03:01:15Z,2020-12-30T03:01:15Z,création
Communauté Urbaine Grand Poitiers,20006985400012,ville de Poitiers,21860194600013,Restaurant Condorcet,86194,R2,autre,élémentaire,tous,2020-01-05,goûter,pain,pain ,p15,[],,,[],"[""céréales contenant du gluten""]","[""sans texture modifiée""]",B,0.3,2020-12-30T03:01:15Z,2020-12-30T03:01:15Z,création
Communauté Urbaine Grand Poitiers,20006985400012,ville de Poitiers,21860194600013,Restaurant Condorcet,86194,R2,autre,élémentaire,tous,2020-01-06,déjeuner,entrée,macédoine vinaigrette,p16,[],,,[],[],"[""sans texture modifiée""]",C,0.61,2020-12-31T03:02:50Z,2020-12-31T03:02:50Z,création
Communauté Urbaine Grand Poitiers,20006985400012,ville de Poitiers,21860194600013,Restaurant Condorcet,86194,R2,autre,élémentaire,tous,2020-01-06,déjeuner,plat principal,gigot d'agneau et sa sauce menthe,p17,[],,,[],[],"[""mixé""]",D,1.23,2020-12-31T03:02:50Z,2020-12-31T03:02:50Z,création
Communauté Urbaine Grand Poitiers,20006985400012,ville de Poitiers,21860194600013,Restaurant Condorcet,86194,R2,autre,élémentaire,tous,2020-01-06,déjeuner,garniture,flageolets,p18,[],,,[],[],"[""sans texture modifiée""]",A,0.34,2020-12-31T03:02:50Z,2020-12-31T03:02:50Z,création
Communauté Urbaine Grand Poitiers,20006985400012,ville de Poitiers,21860194600013,Restaurant Condorcet,86194,R2,autre,élémentaire,tous,2020-01-06,déjeuner,produit laitier,tomme de montagne,p21,[],,,[],[],"[""sans texture modifiée""]",C,0.77,2020-12-31T11:22:13Z,2020-12-31T11:22:13Z,Erreur de livraison
Communauté Urbaine Grand Poitiers,20006985400012,ville de Poitiers,21860194600013,Restaurant Condorcet,86194,R2,autre,élémentaire,tous,2020-01-06,déjeuner,dessert,clémentine,p20,"[""agriculture biologique""]",,,[],[],"[""sans texture modifiée""]",A,0.32,2020-12-31T03:02:50Z,2020-12-31T03:02:50Z,création
