Geo Point;Geo Shape;OBJECTID;id;NOM_SITE;TYPE_ETABL;GESTION;ADRESSE;CODE_POSTA;VILLE;STANDARD
43.5486715619, 1.47721249459;"{""type"": ""Point"", ""coordinates"": [1.47721249458953, 43.54867156186938]}";14;979;ALSH Angela Davis Ramonville;ALSH;Régie;Ecole-Allée G. Pompidou;31520;Ramonville-Saint-Agne;05 61 00 31 45
43.5436857063, 1.46467640414;"{""type"": ""Point"", ""coordinates"": [1.464676404140854, 43.54368570625463]}";1;972;ALSH St Exupéry Ramonville;ALSH;Régie;Ecole-Rue du Salas;31521;Ramonville-Saint-Agne;05 61 00 31 45
43.5304852636, 1.49141740508;"{""type"": ""Point"", ""coordinates"": [1.491417405078288, 43.530485263596375]}";15;984;ALSH Aimé Césaire Auzeville;ALSH;Régie;5-7 Rue Viognier;31320;Auzeville-Tolosane;05 61 73 76 80
43.5069980396, 1.56570099627;"{""type"": ""Point"", ""coordinates"": [1.565700996271709, 43.50699803955022]}";7;1957;ALSH Belberaud;ALSH;Régie;Ecole-3 Rue de la Mairie;31450;Belberaud;05 61 27 64 22
43.5569990924, 1.5646127697;"{""type"": ""Point"", ""coordinates"": [1.564612769704943, 43.556999092397135]}";9;1960;ALSH Lauzerville;ALSH;Régie;Chemin la Bergerie;31650;Lauzerville;05 61 00 66 95
43.4156760108, 1.52265610294;"{""type"": ""Point"", ""coordinates"": [1.522656102939068, 43.415676010778995]}";11;1962;ALSH Noueilles;ALSH;Régie;Place de l'Eglise;31450;Noueilles;07 89 20 67 64
43.5470366721, 1.48314360354;"{""type"": ""Point"", ""coordinates"": [1.48314360354216, 43.547036672083586]}";3;980;ALSH Les Sables Ramonville;ALSH;Régie;Chemin des Sables;31520;Ramonville-Saint-Agne;05 62 17 13 24
43.4888569507, 1.51079535157;"{""type"": ""Point"", ""coordinates"": [1.510795351572618, 43.48885695069183]}";12;1965;ALSH Pompertuzat;ALSH;Régie;Ecole-Rue de la Tuilerie;31450;Pompertuzat;09 62 57 64 62
43.4569413001, 1.57118547355;"{""type"": ""Point"", ""coordinates"": [1.571185473550938, 43.45694130013825]}";10;1961;ALSH Montgiscard;ALSH;Régie;Chemin des Cordeliers;31450;Montgiscard;05 61 81 70 11
43.5212347968, 1.59231499083;"{""type"": ""Point"", ""coordinates"": [1.592314990830347, 43.52123479676876]}";13;3533;ALSH Odars;ALSH;Régie;Ecole-366 Ch. St Papoul;31450;Odars;05 34 66 53 04
43.5189170043, 1.50065762846;"{""type"": ""Point"", ""coordinates"": [1.500657628459685, 43.5189170043077]}";4;981;Centre de loisirs Castanet-Tolosan;ALSH;Prestataire;2 Rue J. Ingres;31320;Castanet-Tolosan;05 61 81 02 24
43.4237208963, 1.5059263791;"{""type"": ""Point"", ""coordinates"": [1.505926379097168, 43.42372089630962]}";8;1958;ALSH Issus;ALSH;Régie;2 Place de la Mairie;31450;Issus;07 89 20 67 64
43.4365922964, 1.60156364328;"{""type"": ""Point"", ""coordinates"": [1.601563643277976, 43.43659229643758]}";16;1956;ALSH Ayguesvives;ALSH;Régie;Allée des Droits de l'homme;31450;Ayguesvives;06 33 78 39 54
43.5309358474, 1.55254684851;"{""type"": ""Point"", ""coordinates"": [1.552546848505127, 43.530935847426534]}";6;1955;ALSH La Caprice Escalquens;ALSH;Régie;Lieu-dit La Caprice;31750;Escalquens;05 61 81 74 77
43.4524879845, 1.61420171878;"{""type"": ""Point"", ""coordinates"": [1.614201718781236, 43.45248798447728]}";17;3535;ALSH Baziège;ALSH;Régie;13 Av. de l'Hers;31450;Baziège;05 34 66 23 66
43.5405595072, 1.48561006362;"{""type"": ""Point"", ""coordinates"": [1.48561006361526, 43.54055950721268]}";2;976;ALSH Port Sud PMF Ramonville;ALSH;Régie;Ecole PMF-Rue E. Zola;31520;Ramonville-Saint-Agne;07 89 20 68 25
43.5514121436, 1.47287117728;"{""type"": ""Point"", ""coordinates"": [1.472871177275387, 43.55141214355254]}";5;982;ALSH Sajus Ramonville;ALSH;Régie;Rue des Hirondelles;31520;Ramonville-Saint-Agne;05 61 00 31 45
43.5482983198, 1.47707717801;"{""type"": ""Point"", ""coordinates"": [1.477077178013406, 43.54829831982941]}";70;17;ALSH J. Jaurès Ramonville;ALSH;Régie;Ecole-Av. G. Pompidou;31520;Ramonville;06 48 49 83 40
