COLL_NOM;COLL_SIRET;DELIB_ID;DELIB_DATE;DELIB_MATIERE_CODE;DELIB_MATIERE_NOM;DELIB_OBJET;BUDGET_ANNEE;BUDGET_NOM;PREF_ID;PREF_DATE;VOTE_EFFECTIF;VOTE_REEL;VOTE_POUR;VOTE_CONTRE;VOTE_ABSTENTION;DELIB_URL
Ville de Poitiers;23350001600040;1DL15494;2017-10-15;1.4;Finances locales/Divers;Lancement d'une démarche partenariale de définition d'une politique montagne et adhésion à l'association nationale des élus de la montagne;2017/2018;Budget annexe déchets-collecte et traitement;PREF038;2018-02-03;43;40;25;10;5;http://www.example.com/delib.docx
Ville de Poitiers;23350001600040;1DL15494;2017-10-15;1.4;Domaines de compétences par thèmes/Divers;Lancement d'une démarche partenariale de définition d'une politique montagne et adhésion à l'association nationale des élus de la montagne;2017/2018;Budget annexe déchets-collecte et traitement;PREF038;2018-02-03;43;40;25;10;5;http://www.example.com/delib.docx
Ville de Poitiers;23350001600040;1DL15494;2017-10-15;1.4;Domaines de competences par themes/Divers;Lancement d'une démarche partenariale de définition d'une politique montagne et adhésion à l'association nationale des élus de la montagne;2017/2018;Budget annexe déchets-collecte et traitement;PREF038;2018-02-03;43;40;25;10;5;http://www.example.com/delib.docx
Ville de Poitiers;23350001600040;1DL15494;2017-10-15;1.4;domaines de compétences par thèmes/Divers;Lancement d'une démarche partenariale de définition d'une politique montagne et adhésion à l'association nationale des élus de la montagne;2017/2018;Budget annexe déchets-collecte et traitement;PREF038;2018-02-03;43;40;25;10;5;http://www.example.com/delib.docx
Ville de Poitiers;23350001600040;1DL15494;2017-10-15;1.4;dOmAiNeS dE compétences par thEmes/Divers;Lancement d'une démarche partenariale de définition d'une politique montagne et adhésion à l'association nationale des élus de la montagne;2017/2018;Budget annexe déchets-collecte et traitement;PREF038;2018-02-03;43;40;25;10;5;http://www.example.com/delib.docx
