{
  "$schema": "https://opendataschema.frama.io/catalog/schema-catalog.json",
  "version": 1,
  "schemas": [
    {
      "repo_url": "https://gitlab.com/opendatafrance/scdl/catalogue/",
      "doc_url_by_ref": {
        "~latest_tag": "https://schema.data.gouv.fr/scdl/catalogue/0.1.3/documentation.html"
      }
    },
    {
      "repo_url": "https://gitlab.com/opendatafrance/scdl/deliberations/",
      "doc_url_by_ref": {
        "~latest_tag": "https://schema.data.gouv.fr/scdl/deliberations/2.1.5/documentation.html"
      }
    },
    {
      "repo_url": "https://gitlab.com/opendatafrance/scdl/equipements/",
      "doc_url_by_ref": {
        "~latest_tag": "https://schema.data.gouv.fr/scdl/equipements/0.1.4/documentation.html"
      }
    },
    {
      "repo_url": "https://gitlab.com/opendatafrance/scdl/subventions/",
      "doc_url_by_ref": {
        "~latest_tag": "https://schema.data.gouv.fr/scdl/subventions/2.1.1/documentation.html"
      }
    },
    {
      "repo_url": "https://gitlab.com/opendatafrance/scdl/budget/",
      "doc_url_by_ref": {
        "~latest_tag": "https://schema.data.gouv.fr/scdl/budget/0.8.3/documentation.html"
      }
    },
    {
      "repo_url": "https://gitlab.com/opendatafrance/scdl/menus-collectifs",
      "doc_url_by_ref": {
        "~latest_tag": "https://schema.data.gouv.fr/scdl/menus-collectifs/1.2.3/documentation.html"
      }
    },
    {
      "repo_url": "https://gitlab.com/opendatafrance/scdl/plats-menus-collectifs",
      "doc_url_by_ref": {
        "~latest_tag": "https://schema.data.gouv.fr/scdl/plats-menus-collectifs/0.7.2/documentation.html"
      }
    },
    {
      "repo_url": "https://gitlab.com/opendatafrance/scdl/prenoms",
      "doc_url_by_ref": {
        "~latest_tag": "https://schema.data.gouv.fr/scdl/prenoms/1.1.6/documentation.html"
      }
    }
  ]
}
