{
    "course/course": {
        "catalog_visibility": "both",
        "cert_html_view_enabled": true,
        "course_image": "opencraftlogo.png",
        "discussion_topics": {
            "General": {
                "id": "course"
            }
        },
        "display_name": "OpenCraft's on-boarding",
        "graceperiod": "",
        "instructor_info": {
            "instructors": []
        },
        "invitation_only": false,
        "language": "en",
        "learning_info": [],
        "minimum_grade_credit": 0.8,
        "no_grade": true,
        "start": "2017-08-29T00:00:00Z",
        "tabs": [
            {
                "course_staff_only": false,
                "name": "Course",
                "type": "courseware"
            },
            {
                "course_staff_only": false,
                "name": "Textbooks",
                "type": "textbooks"
            },
            {
                "course_staff_only": false,
                "name": "Discussion",
                "type": "discussion"
            },
            {
                "course_staff_only": false,
                "is_hidden": true,
                "name": "Wiki",
                "type": "wiki"
            },
            {
                "course_staff_only": false,
                "name": "Progress",
                "type": "progress"
            }
        ],
        "xml_attributes": {
            "filename": [
                "course/course.xml",
                "course/course.xml"
            ]
        }
    }
}