<?xml version="1.0" encoding="UTF-8" standalone="no"?>
<!-- Created with Inkscape (http://www.inkscape.org/) -->

<svg
   width="71.172913mm"
   height="69.320831mm"
   viewBox="0 0 71.172911 69.320831"
   version="1.1"
   id="svg1"
   inkscape:version="1.4-dev (1:1.4.0-dev+202403210151+2fe0648968)"
   sodipodi:docname="mooc_floss_course_samples.svg"
   xml:space="preserve"
   inkscape:export-filename="html/images/mod2-Djangos_page_about_contributing.svg"
   inkscape:export-xdpi="96"
   inkscape:export-ydpi="96"
   inkscape:export-batch-path="video/patch_animation/patch_parts"
   inkscape:export-batch-name=" "
   xmlns:inkscape="http://www.inkscape.org/namespaces/inkscape"
   xmlns:sodipodi="http://sodipodi.sourceforge.net/DTD/sodipodi-0.dtd"
   xmlns="http://www.w3.org/2000/svg"
   xmlns:svg="http://www.w3.org/2000/svg"><sodipodi:namedview
     id="namedview1"
     pagecolor="#ffffff"
     bordercolor="#000000"
     borderopacity="0.25"
     inkscape:showpageshadow="2"
     inkscape:pageopacity="0.0"
     inkscape:pagecheckerboard="0"
     inkscape:deskcolor="#d1d1d1"
     inkscape:document-units="mm"
     inkscape:zoom="1.4142136"
     inkscape:cx="4272.3391"
     inkscape:cy="2351.4835"
     inkscape:window-width="1920"
     inkscape:window-height="1011"
     inkscape:window-x="0"
     inkscape:window-y="0"
     inkscape:window-maximized="1"
     inkscape:current-layer="layer1"
     showguides="true"
     showgrid="false"
     inkscape:lockguides="false"><inkscape:grid
       id="grid5732"
       units="mm"
       originx="-1063.6251"
       originy="-773.64164"
       spacingx="0.26458332"
       spacingy="0.26458333"
       empcolor="#0099e5"
       empopacity="0.30196078"
       color="#0099e5"
       opacity="0.14901961"
       empspacing="5"
       enabled="true"
       visible="false" /></sodipodi:namedview><defs
     id="defs1" /><g
     inkscape:label="Layer 1"
     inkscape:groupmode="layer"
     id="layer1"
     transform="translate(-1139.0667,-646.35837)"><g
       id="g22"><path
         style="fill:#4d4d4d;fill-opacity:1;stroke-width:8.38675;-inkscape-stroke:none;paint-order:markers fill stroke"
         d="m 1151.4821,660.82769 -0.6548,7.67064 0.2806,14.96711 0.5613,6.73518 3.274,3.64824 4.8644,0.4677 36.0145,-0.93543 2.7128,-4.30302 0.2807,-2.24508 -0.8419,-25.5376 -3.2741,-4.02241 -2.8063,-0.46773 -37.4178,0.93545 -2.245,1.96444 z"
         id="path6171" /><path
         id="path5909"
         style="opacity:0.2;fill:#4d4d4d;fill-opacity:1;stroke-width:8.38675;-inkscape-stroke:none;paint-order:markers fill stroke"
         d="m 1186.3457,659.04641 c -1.5307,-0.0124 -3.0626,-0.009 -4.6385,5.2e-4 -1.8486,0.0117 -3.6958,0.0472 -5.5438,0.0708 -6.0148,0.16117 -12.0411,0.30137 -18.0025,1.01854 -0.052,-0.0206 -0.1076,-0.0385 -0.1809,-0.0615 -0.2046,-0.0642 -0.408,-0.0897 -0.6062,-0.0899 -0.5957,-4.3e-4 -1.1486,0.22017 -1.6293,0.38499 a 0.27632859,0.25377126 75.265 0 0 -0.037,0.016 c -0.2586,0.14041 -0.5513,0.26616 -0.8335,0.45578 -0.5474,0.36793 -1.0043,0.85032 -1.325,1.4242 -7e-4,1.5e-4 -0.01,-0.005 -0.01,-0.004 h -5e-4 c -0.01,0.0209 -0.014,0.0411 -0.021,0.062 -0.272,0.50678 -0.4407,1.08157 -0.4594,1.71979 v 0.002 c 10e-5,7.6e-4 0,0.0194 0,0.0336 -0.2102,1.07768 -0.3348,2.11198 -0.4548,3.31815 -0.2832,2.84753 -0.3973,5.17936 -0.4449,8.08942 -0.026,1.56783 0,3.13914 0,4.70876 0.086,2.81795 0.1811,5.65679 0.5664,8.45995 l -0.025,0.82579 c -0.01,0.005 0,0.006 -0.064,0.0589 -0.065,0.0695 -0.066,0.18034 -0.066,0.17673 -0.036,1.7246 0.4342,3.4822 1.4408,4.86637 0.1667,0.22931 0.3478,0.43155 0.5286,0.62426 l 0.02,0.0444 0.032,0.0113 c 0.1399,0.14799 0.2803,0.29286 0.4093,0.43822 a 0.27632859,0.25377126 75.265 0 0 0.033,0.0321 c 1.1935,0.96256 2.5517,1.6618 4.0287,1.757 0.1132,0.008 0.2336,0.005 0.3535,0.002 l 0.01,0.004 0.01,-0.004 c 0.4706,-0.0121 0.9705,-0.11579 1.3978,-0.38034 l 1.1431,-0.0124 c 4.6804,0.18355 9.3614,0.30596 14.0369,0.29146 2.0787,-0.007 4.1549,-0.0558 6.2327,-0.0837 2.1065,-0.0741 3.5437,-0.11518 4.963,-0.17105 0.089,0.23112 0.1998,0.45403 0.3374,0.66301 0.1142,0.17346 0.2476,0.31691 0.3581,0.45837 a 0.17160561,0.17160561 0 0 0 0.019,0.0217 c 0.118,0.10697 0.2373,0.23772 0.3917,0.35243 0.1191,0.0885 0.3129,0.21111 0.5255,0.28009 0.1063,0.0345 0.2188,0.0575 0.3364,0.0424 0.02,-0.003 0.039,-0.0152 0.058,-0.0206 0.067,0.46911 0.2476,0.91666 0.6149,1.25315 0.152,0.13917 0.3179,0.22749 0.4512,0.32247 a 0.17160561,0.17160561 0 0 0 0.022,0.013 c 0.1285,0.0656 0.262,0.12105 0.3974,0.17157 -0.037,0.32477 -0.056,0.62804 -0.075,0.99529 -0.02,0.39616 -0.039,0.79248 -0.044,1.18959 -0.012,0.89405 0.023,2.15083 0.042,3.03185 0.053,1.29366 0.061,1.86313 0.1716,3.13314 0.061,0.69518 0.1224,1.33535 0.2868,2.00867 0.031,0.12648 0.087,0.24454 0.1307,0.3669 0,0.0135 0.1752,0.0745 0.1788,0.061 0.064,-0.10153 0.1538,-0.1887 0.1922,-0.3049 0.01,-0.0198 0.012,-0.0417 0.018,-0.062 0.066,0.0167 0.1624,0.037 0.169,0.0331 0.1291,-0.0406 0.2886,-0.0709 0.3871,-0.12195 l 3.1801,-4.47002 c 0.017,0.0418 0.034,0.0833 0.051,0.12506 l 3.2241,4.53202 c 0.098,0.051 0.2579,0.0814 0.387,0.12196 0.01,0.003 0.077,-0.0111 0.1396,-0.0258 0.011,0.0335 0.022,0.067 0.031,0.10077 0,0.0132 0.1697,0.0857 0.1741,0.0723 0.071,-0.0972 0.1659,-0.17802 0.2119,-0.29146 0.2222,-0.54856 0.3032,-1.33221 0.3587,-1.89497 0.1314,-1.33387 0.1119,-1.75458 0.141,-3.12901 -0.02,-1.44125 -0.038,-2.8804 -0.1173,-4.32067 -0.018,-0.31893 -0.034,-0.6384 -0.063,-0.95653 -0.011,-0.12247 -0.029,-0.25434 -0.049,-0.38705 0.1059,-0.0607 0.2093,-0.12271 0.307,-0.18656 0.1727,-0.11288 0.3245,-0.2442 0.4749,-0.35812 a 0.14244923,0.14244923 0 0 0 0.013,-0.0119 c 0.1216,-0.11858 0.2597,-0.23333 0.3871,-0.37827 0.3736,-0.42509 0.6356,-0.97003 0.755,-1.55391 0.5116,-0.27347 0.9067,-0.76774 1.1441,-1.23507 0.1048,-0.2064 0.1584,-0.41911 0.2289,-0.60668 a 0.14244923,0.14244923 0 0 0 0.01,-0.0315 c 0.026,-0.19619 0.075,-0.40383 0.083,-0.62942 0.018,-0.50631 -0.08,-1.10597 -0.3245,-1.60766 a 0.14244923,0.14244923 0 0 0 0.01,-0.002 c 0.115,-0.0604 0.2765,-0.10569 0.4217,-0.22583 0.7093,-0.58712 0.7567,-1.6475 0.6035,-2.43344 -0.051,-0.26054 -0.1468,-0.49575 -0.2149,-0.72347 a 0.14244923,0.14244923 0 0 0 -0.011,-0.0258 c -0.1142,-0.21431 -0.2124,-0.45445 -0.3633,-0.68007 -0.513,-0.76703 -1.3239,-1.30151 -2.2107,-1.51309 -0.013,-1.3654 -0.043,-2.73187 -0.081,-4.09845 -0.1192,-4.1086 -0.2271,-8.21533 -0.4749,-12.32379 -0.09,-1.49935 -0.2571,-3.9345 -0.4599,-5.53197 -0.05,-0.39368 -0.1294,-0.7836 -0.2,-1.17461 0.016,-7.1e-4 0.032,-3.2e-4 0.045,-0.002 0.02,-0.003 0.037,-0.007 0.062,-0.0145 0.013,-0.004 0.026,-0.006 0.054,-0.0212 0.01,-0.004 0.015,-0.009 0.025,-0.016 0.01,-0.007 0.037,-0.0302 0.037,-0.0305 3e-4,-3.2e-4 0.05,-0.0736 0.051,-0.0739 2e-4,-3.1e-4 0.024,-0.15162 0.024,-0.15193 a 0.27632859,0.25377126 75.265 0 0 0,-0.0227 c -0.2457,-1.3138 -0.085,-0.68512 -0.5932,-2.09187 a 0.27632859,0.25377126 75.265 0 0 -0.032,-0.0641 c -0.2509,-0.37615 -0.4876,-0.8218 -0.8046,-1.20303 -1.2639,-1.51984 -2.9264,-2.10662 -4.4436,-2.37401 a 0.27632859,0.25377126 75.265 0 0 -0.042,-0.003 c -0.2224,0.0776 -0.1455,0.0136 -0.2248,0.15709 -0.01,1e-5 -0.01,0.0336 -0.01,0.0475 -0.1461,-0.005 -0.2713,-0.006 -0.4749,-0.0222 -0.8803,-0.0727 -1.7623,-0.11139 -2.6432,-0.14159 -1.5712,-0.0539 -3.1006,-0.0822 -4.6313,-0.0946 z m 5.4705,50.84031 c 0.019,0.008 0.039,0.0124 0.059,0.0134 -0.024,0.0472 -0.047,0.0932 -0.07,0.13952 0,-0.0514 0.01,-0.10219 0.011,-0.15296 z m 7.1582,0.15813 c 0,0.0379 0.01,0.0758 0.01,0.11369 -0.013,-0.0249 -0.024,-0.0493 -0.037,-0.0745 l -0.018,-0.0253 c 0.017,-0.003 0.032,-0.008 0.047,-0.014 z" /><path
         style="fill:#999999;fill-opacity:1;stroke-width:8.38675;-inkscape-stroke:none;paint-order:markers fill stroke"
         d="m 1152.0434,690.76189 1.4967,2.15151 4.0224,1.96445 2.2451,-1.12254 -0.9355,-36.20165 -4.8643,0.74835 -2.2451,1.77734 -0.6548,3.08697 -0.093,17.9605 -0.1871,6.08039 0.3742,2.24507 z"
         id="path6189" /><path
         id="path6190"
         style="fill:#000000;fill-opacity:1;stroke-width:9.19434;-inkscape-stroke:none;paint-order:markers fill stroke"
         d="m 1184.475,656.42706 c -1.5307,-0.0124 -3.0626,-0.009 -4.6385,7.6e-4 -1.8486,0.0117 -3.6961,0.0471 -5.5442,0.0707 -6.0147,0.16117 -12.0407,0.30158 -18.0021,1.01875 -0.052,-0.0206 -0.1079,-0.0389 -0.1812,-0.0619 -0.2046,-0.0642 -0.4079,-0.0895 -0.6061,-0.0897 -0.5957,-4.2e-4 -1.1486,0.22006 -1.6293,0.38488 a 0.27632859,0.25377126 75.265 0 0 -0.037,0.0162 c -0.2586,0.14041 -0.5517,0.26599 -0.8339,0.45561 -0.5474,0.36794 -1.0042,0.85037 -1.3248,1.42425 -8e-4,1.6e-4 -0.01,-0.005 -0.01,-0.004 h -5e-4 c -0.01,0.021 -0.014,0.0415 -0.021,0.0624 -0.272,0.50677 -0.441,1.08123 -0.4597,1.71945 l 10e-5,0.002 c 10e-5,7.6e-4 0,0.0198 0,0.034 -0.2102,1.07768 -0.3344,2.11187 -0.4543,3.31804 -0.2832,2.84753 -0.3978,5.17922 -0.4454,8.08928 -0.026,1.56782 0,3.13925 0,4.70886 0.094,3.0854 0.195,6.19612 0.6807,9.25731 -0.2064,0.0488 -0.049,-0.0478 -0.2028,0.0874 -0.065,0.0695 -0.066,0.18018 -0.066,0.17657 -0.036,1.7246 0.4344,3.48232 1.441,4.86649 0.3125,0.42976 0.6785,0.76657 0.9902,1.1179 a 0.27632859,0.25377126 75.265 0 0 0.032,0.0323 c 1.1935,0.96255 2.5518,1.66157 4.0289,1.75678 0.5937,0.0382 1.3067,-0.0413 1.8628,-0.42834 2e-4,-1.5e-4 2e-4,-4.1e-4 5e-4,-5.5e-4 5.0292,0.20704 10.0596,0.34644 15.0838,0.33085 2.0787,-0.007 4.1553,-0.0556 6.233,-0.0835 4.4433,-0.15636 6.082,-0.16536 10.2981,-0.47734 0.8968,-0.0664 1.7931,-0.1425 2.6846,-0.25232 0.01,0.013 0.041,0.0656 0.041,0.0657 10e-5,7e-5 0.071,0.059 0.071,0.0591 10e-5,3e-5 0.1294,0.034 0.1295,0.034 l -0.06,-0.007 c 0.1189,0.0284 0.3067,0.14272 0.5686,0.12477 0.7984,-0.0549 1.3355,-0.477 1.9389,-0.81155 a 0.27632859,0.25377126 75.265 0 0 0.035,-0.0222 c 0.3543,-0.28652 0.7477,-0.55597 1.1082,-0.89676 0.9538,-0.90162 1.9275,-2.09643 2.0515,-3.57259 0.01,-7.6e-4 0.034,0.002 0.034,-7.6e-4 0.054,-2.44739 7e-4,-4.89879 -0.067,-7.35126 -0.1192,-4.1086 -0.2272,-8.21567 -0.475,-12.32414 -0.09,-1.49935 -0.2568,-3.93407 -0.4597,-5.53154 -0.05,-0.39368 -0.1296,-0.78371 -0.2002,-1.17471 0.016,-7.2e-4 0.031,-5.5e-4 0.045,-0.002 0.02,-0.003 0.037,-0.007 0.062,-0.0145 0.013,-0.004 0.027,-0.006 0.054,-0.0212 0.01,-0.004 0.015,-0.009 0.025,-0.0162 0.01,-0.007 0.037,-0.0297 0.037,-0.03 3e-4,-3.2e-4 0.051,-0.0738 0.051,-0.0741 2e-4,-3.1e-4 0.024,-0.15175 0.024,-0.15206 a 0.27632859,0.25377126 75.265 0 0 0,-0.0229 c -0.2457,-1.3138 -0.085,-0.68478 -0.5935,-2.09153 a 0.27632859,0.25377126 75.265 0 0 -0.032,-0.0641 c -0.251,-0.37615 -0.4874,-0.82189 -0.8044,-1.20312 -1.264,-1.51984 -2.9268,-2.10653 -4.4441,-2.37392 a 0.27632859,0.25377126 75.265 0 0 -0.041,-0.003 c -0.2225,0.0776 -0.1457,0.0136 -0.2249,0.15708 -0.01,2e-5 -0.01,0.0335 -0.01,0.0474 -0.1461,-0.005 -0.2711,-0.006 -0.4747,-0.0222 -0.8803,-0.0727 -1.7621,-0.11129 -2.6431,-0.14149 -1.5712,-0.0539 -3.1006,-0.0823 -4.6313,-0.0947 z m 7.9034,0.772 c 0.053,0.0243 0.1094,0.0526 0.1403,0.0597 l -0.099,-0.0128 c 1.1097,0.37197 2.2199,0.74996 3.1923,1.53342 0.8106,0.65301 0.8664,0.85142 1.5007,1.76456 0.6082,1.21309 0.3814,0.53594 0.6689,1.78686 l -0.01,-0.0557 c 0,1.5e-4 0.017,0.0912 0.017,0.0913 0,7e-5 0.01,0.0189 0.021,0.0379 -2e-4,3.4e-4 0,7.6e-4 0,7.6e-4 0.036,0.4374 0.082,0.87456 0.1079,1.31229 0.1899,3.16382 0.2217,6.33279 0.3158,9.49626 0.1449,4.87734 0.1026,3.53523 0.3215,8.31375 0.092,2.09789 0.2649,4.19299 0.4379,6.28796 -0.017,-0.002 -0.033,-0.006 -0.047,-0.006 h -8e-4 c -0.3142,0.0184 -0.094,-0.0235 -0.2907,0.034 -0.1468,0.0717 -0.1708,0.21354 -0.1593,0.26122 0.016,0.40852 0.045,0.567 -0.062,0.94022 -0.4369,1.52944 -1.7387,2.5694 -2.925,3.58205 0,0.002 0,0.003 -0.01,0.006 -0.3252,0.23474 -0.6511,0.49245 -0.9822,0.68232 -0.3602,-0.0388 -0.7238,-0.0199 -1.085,-0.0218 -0.9827,-0.005 -1.9646,0.0117 -2.9467,0.024 -4.4559,0.056 -5.6222,0.0932 -10.3421,0.19495 -6.9028,0.16424 -13.812,0.23984 -20.7098,0.48069 0.011,-0.0187 0.044,-0.0734 0.044,-0.0735 0,-1e-4 0.015,-0.0768 0.015,-0.0769 0,-2.3e-4 -0.01,-0.091 -0.01,-0.0913 0,-3.2e-4 -0.01,-0.0347 -0.014,-0.0451 0,-0.0104 -0.01,-0.0177 -0.011,-0.024 -0.013,-0.0252 -0.021,-0.0344 -0.027,-0.0434 -0.013,-0.0181 -0.022,-0.028 -0.033,-0.0401 -0.01,-0.012 -0.02,-0.0238 -0.036,-0.0384 -0.01,-0.008 -0.015,-0.0149 -0.037,-0.0306 -0.01,-0.004 -0.012,-0.009 -0.021,-0.0145 -0.01,-0.006 -0.041,-0.0189 -0.041,-0.019 -2e-4,-10e-5 -0.094,-0.0145 -0.094,-0.0145 -10e-5,10e-6 -0.084,0.0172 -0.084,0.0172 0,3e-5 -0.088,0.0662 -0.088,0.0663 l 0.033,-0.0323 c -0.1461,0.11829 -0.2345,0.22127 -0.2891,0.24509 -0.4184,0.18228 -1.0657,0.19615 -1.5416,0.132 -1.2228,-0.16491 -2.3671,-0.66582 -3.4069,-1.47103 -0.3262,-0.34246 -0.6613,-0.63421 -0.9204,-0.9703 -0.8423,-1.09268 -1.2612,-2.48105 -1.3924,-3.90956 -0.1954,-3.29339 -0.2694,-6.59071 -0.3691,-9.88393 -0.012,-1.55849 -0.042,-3.11788 -0.037,-4.67544 0.011,-3.1801 0.064,-4.97692 0.239,-8.06756 0.06,-1.05616 0.1269,-2.1237 0.237,-3.17878 0.01,7.1e-4 0.015,0.002 0.023,0.002 0.041,0.003 0.081,0.006 0.1206,0.005 0.02,-3.2e-4 0.039,4e-5 0.068,-0.005 0.015,-0.002 0.031,-0.005 0.064,-0.019 0.01,-0.003 0.018,-0.008 0.029,-0.0145 0.011,-0.007 0.039,-0.0287 0.039,-0.029 3e-4,-3e-4 0.047,-0.0587 0.047,-0.059 2e-4,-3.2e-4 0.036,-0.10105 0.036,-0.10138 a 0.27632859,0.25377126 75.265 0 0 7e-4,-0.0145 c 0.1097,-1.10204 0.6828,-1.93566 1.5653,-2.49758 0.2182,-0.13894 0.4753,-0.24641 0.7396,-0.38321 0.6807,-0.22152 0.6952,-0.27109 1.3723,-0.33532 0.1125,-0.0107 0.2719,0.0162 0.4716,-0.007 0.063,-0.008 0.082,-0.0226 0.1221,-0.0368 0.024,0.002 0.049,0.007 0.049,0.007 0,0 0,-0.0165 0,-0.019 0.013,-0.006 0.036,-0.01 0.047,-0.0145 7e-4,0.004 0.01,0.024 0.01,0.024 l 0.01,-0.003 c 0,0 -0.01,-0.02 -0.01,-0.024 0.01,-0.002 0.022,-0.006 0.028,-0.008 a 0.27632859,0.25377126 75.265 0 0 0.1181,-0.11251 0.27632859,0.25377126 75.265 0 0 0.01,0.003 c 10e-5,-3.5e-4 0,-0.003 0.01,-0.0172 a 0.27632859,0.25377126 75.265 0 0 0,-0.002 c 0.014,-0.0312 0.033,-0.0602 0.05,-0.13312 0.012,-0.0501 0,-0.13594 -0.031,-0.21445 0.5329,2.1e-4 0.8784,-7.6e-4 1.7536,-0.0222 3.2003,-0.0784 2.2878,-0.10262 6.0528,-0.14705 3.3788,-0.0399 6.7595,-0.0386 10.1391,-0.0619 1.8477,-0.0165 3.6958,-0.0308 5.5434,-0.0496 3.3877,-0.0344 5.9005,-0.0539 9.2196,-0.14815 0.8666,-0.0245 1.7332,-0.0514 2.598,-0.10027 0.228,-0.0129 0.3812,-0.0145 0.5383,-0.0172 z" /><path
         id="path6191"
         style="stroke-width:8.38675;paint-order:markers fill stroke"
         d="m 1169.4372,660.38888 c -2e-4,0 -0.1173,0.0252 -0.1175,0.0253 -2e-4,7e-5 -0.03,0.0206 -0.052,0.0357 a 0.27890875,0.27890875 0 0 0 -0.012,0.006 c 0,0.002 -0.012,0.009 -0.012,0.009 -2e-4,1.9e-4 -0.038,0.0459 -0.039,0.0461 -2e-4,2.8e-4 -0.016,0.0259 -0.021,0.0357 -0.019,0.0393 -0.021,0.0562 -0.024,0.0714 -0.01,0.0304 -0.01,0.0459 -0.01,0.0625 0,0.0274 -6e-4,0.0531 0,0.0789 -0.014,0.003 -0.03,0.003 -0.043,0.006 -0.058,0.0113 -0.065,0.01 -0.1131,0.0164 a 0.27890875,0.27890875 0 0 0 -0.2128,-0.13245 c -1.6665,-0.0396 -3.3327,0.0799 -4.9839,0.36014 0.01,-0.0145 0.012,-0.0312 0.012,-0.0312 0,-3e-4 0.01,-0.0591 0.01,-0.0595 0,-3.8e-4 0,-0.028 0,-0.0387 -0.01,-0.0428 -0.014,-0.0598 -0.019,-0.0744 -0.012,-0.0293 -0.02,-0.0427 -0.028,-0.0581 -0.018,-0.0305 -0.037,-0.0584 -0.057,-0.0863 -0.02,-0.0279 -0.039,-0.0536 -0.062,-0.0804 -0.012,-0.0133 -0.022,-0.0255 -0.046,-0.0462 -0.012,-0.0104 -0.024,-0.0238 -0.062,-0.0431 -0.01,-0.005 -0.035,-0.0148 -0.036,-0.0149 -4e-4,-1.2e-4 -0.058,-0.0133 -0.058,-0.0134 -3e-4,-3e-5 -0.089,0.003 -0.089,0.003 -2e-4,5e-5 -0.094,0.0411 -0.1027,0.0447 -0.7694,0.48014 -1.5847,1.1246 -1.9182,2.08496 -0.07,0.20095 -0.082,0.38012 -0.1117,0.51938 a 0.27890875,0.27890875 0 0 0 -0.01,0.0848 c 0.036,0.37602 0.1096,0.7028 0.3631,0.92118 0.2318,0.19973 0.5679,0.19909 0.9256,0.0893 10e-5,0 0.1265,-0.0297 0.1265,-0.0298 0,-10e-6 0.095,-0.0788 0.095,-0.0789 0,-4e-5 0.04,-0.0744 0.04,-0.0744 0,-5e-5 0.013,-0.0505 0.013,-0.0506 0,-8e-5 5e-4,-0.0207 0,-0.0372 1.9124,0.0191 3.8233,-0.0537 5.722,-0.1637 a 0.27890875,0.27890875 0 0 0 0.1697,-0.0774 c 0.023,0.0162 0.047,0.0341 0.048,0.0342 10e-5,6e-5 0.085,0.0253 0.085,0.0253 10e-5,2e-5 0.119,-0.0104 0.1191,-0.0104 l -0.052,0.0104 c 0.086,-0.01 0.171,-0.0202 0.2545,-0.0312 0.063,0.008 0.1297,-0.005 0.2038,-0.0298 v -0.002 c 0.7826,-0.12185 1.4936,-0.37719 2.0701,-1.12507 a 0.27890875,0.27890875 0 0 0 0.045,-0.0833 c 0.039,-0.12212 0.1714,-0.30828 0.1801,-0.5923 0.01,-0.28674 -0.1016,-0.5435 -0.2679,-0.73219 -0.1663,-0.18868 -0.38,-0.31963 -0.6042,-0.42115 -0.4483,-0.20306 -0.9525,-0.29145 -1.2709,-0.34973 a 0.27890875,0.27890875 0 0 0 -0.073,0.0194 z m 0,0.90482 a 0.27890875,0.27890875 0 0 0 0.1474,0.23662 c -0.01,0.004 -0.01,0.005 -0.01,0.006 l -0.1801,0.0194 c 0.1168,0.0265 0.2152,0.0483 0.3066,0.0581 0.023,0.002 0.045,0.004 0.076,0.003 0.03,-7.6e-4 0.066,0.0109 0.1562,-0.0431 0.011,-0.007 0.023,-0.0149 0.036,-0.0253 0.012,-0.0104 0.037,-0.0368 0.037,-0.0372 7e-4,-7.6e-4 0.058,-0.11367 0.058,-0.11459 10e-5,-2.7e-4 0,-0.0191 0.01,-0.0372 0.099,0.0331 0.1861,0.0487 0.2768,0.0893 0.1617,0.0723 0.2973,0.1584 0.372,0.23663 0.075,0.0782 0.095,0.12615 0.086,0.20983 0,0.0202 -0.056,0.11909 -0.1087,0.22918 -0.3664,0.36966 -0.8233,0.66584 -1.3096,0.8438 -0.051,-0.0335 -0.097,-0.0792 -0.1473,-0.0893 -0.085,-0.0171 -0.1564,-0.0104 -0.2203,0 -0.1278,0.021 -0.2349,0.063 -0.3244,0.0923 -0.087,0.0286 -0.1593,0.0333 -0.1384,0.0357 a 0.27890875,0.27890875 0 0 0 -0.1444,-0.1384 c -2.121,0.0209 -4.2382,0.11612 -6.353,0.25299 0.014,-0.0734 0.028,-0.16288 0.046,-0.2143 0.1233,-0.34484 0.35,-0.6421 0.6191,-0.92119 2.0201,-0.29899 4.0554,-0.41761 6.1031,-0.43306 a 0.27890875,0.27890875 0 0 0 0.1756,-0.0848 c 0.1112,0.0257 0.1949,0.0434 0.3095,0.0699 0.032,0.0139 0.069,0.0298 0.069,0.0298 0,0 0.055,-0.27382 0.055,-0.27383 z m -6.6938,0.68308 -0.013,0.003 c 5e-4,-5.2e-4 7e-4,-7.6e-4 0,-0.002 0,-2e-4 0.012,-0.002 0.012,-0.002 z m 5.8218,1.03727 c 0.019,0.004 0.06,0.014 0.092,0.0506 0.036,0.0407 0.038,0.08 0.037,0.0729 a 0.27890875,0.27890875 0 0 0 -0.1294,-0.12352 z" /><path
         id="path6192"
         style="stroke-width:8.38675;paint-order:markers fill stroke"
         d="m 1179.4051,664.56028 c -0.021,7.6e-4 -0.094,0.0158 -0.1086,0.0223 -0.01,-0.047 -0.4084,0.6258 -0.091,0.1518 -0.014,0.0485 -0.026,0.10612 -0.037,0.16519 -0.011,0.059 -0.018,0.11803 -0.022,0.16816 0,0.0251 0,0.0467 0,0.0729 8e-4,0.0131 8e-4,0.026 0.01,0.0506 0,0.006 0.01,0.0142 0.01,0.0223 0,0.008 0.017,0.0277 0.018,0.0283 4e-4,5e-4 0.034,0.0325 0.034,0.0328 10e-5,3e-5 0,0.002 0.01,0.003 0.2333,0.14929 0.5745,0.314 0.8453,0.5164 0.2708,0.2024 0.4475,0.41979 0.4271,0.67117 0,0.0394 -0.052,0.11907 -0.097,0.21728 -0.1023,0.0878 -0.1935,0.17614 -0.2843,0.23811 -0.2948,0.20128 -0.9722,0.56547 -1.2843,0.62802 -0.066,0.0131 -0.1644,-0.002 -0.2872,-0.002 -10e-5,0 -0.064,0.0148 -0.064,0.0148 -10e-5,7e-5 -0.041,0.0281 -0.042,0.0283 -2e-4,2.7e-4 -0.031,0.0441 -0.031,0.0447 -3e-4,5.2e-4 -0.01,0.019 -0.01,0.0253 0,0.006 0,0.0106 0,0.0149 0,0.0172 0,0.0267 0,0.0372 -8e-4,0.021 2e-4,0.0427 0,0.064 0,0.0213 0,0.041 0.01,0.0625 0,0.0107 0,0.0209 0.01,0.0387 0,0.009 0.01,0.0197 0.019,0.0402 0,0.005 0.013,0.0177 0.014,0.0178 10e-5,1.9e-4 0.024,0.0207 0.024,0.0209 2e-4,1.3e-4 0.04,0.0222 0.04,0.0223 10e-5,6e-5 0.058,0.008 0.058,0.008 l -0.03,-0.002 c 0.7373,0.10724 1.5147,0.12364 2.1802,-0.37652 0.1999,-0.15018 0.3334,-0.34088 0.4748,-0.48663 a 0.14916659,0.14916659 0 0 0 0.036,-0.0595 c 0.052,-0.16554 0.1691,-0.35536 0.1831,-0.60124 0.031,-0.54647 -0.2812,-0.97929 -0.6816,-1.2843 -0.4005,-0.30501 -0.8953,-0.50142 -1.2992,-0.61314 a 0.14916659,0.14916659 0 0 0 -0.015,-0.003 z m -10.6867,0.89738 c -0.048,-0.008 -0.1164,0.0527 -0.1086,0.0446 a 0.14916659,0.14916659 0 0 0 -0.016,0.0209 c -0.4043,0.57911 -0.8508,1.42855 -0.6459,2.21889 0.038,0.14617 0.1178,0.24485 0.1578,0.32442 a 0.14916659,0.14916659 0 0 0 0.082,0.0729 c 0.2265,0.0843 0.2695,0.12339 0.3706,0.14287 0.096,0.0185 0.1614,-0.008 0.3408,-0.0312 10e-5,0 0.064,-0.0149 0.064,-0.0149 10e-5,-4e-5 0.045,-0.0312 0.045,-0.0312 2e-4,-2e-4 0.033,-0.0517 0.033,-0.0521 10e-5,-3.9e-4 0.01,-0.0216 0.01,-0.0283 0,-0.007 0,-0.0105 0,-0.0149 0,-0.0174 7e-4,-0.0267 0,-0.0357 0,-0.0179 0,-0.0339 -0.01,-0.0506 0,-0.0167 -0.01,-0.0319 -0.01,-0.0491 0,-0.009 -0.01,-0.0162 -0.012,-0.0312 0,-0.004 0,-0.008 -0.01,-0.0134 0,-0.005 -0.013,-0.0219 -0.013,-0.0223 -3e-4,-3.6e-4 -0.037,-0.0341 -0.037,-0.0342 -10e-5,-8e-5 -0.044,-0.0208 -0.045,-0.0208 -10e-5,-4e-5 -0.064,-0.003 -0.064,-0.003 l 0.034,-0.002 c -0.066,-0.004 -0.1113,-0.003 -0.1459,-0.002 -0.1719,-0.61181 0.2071,-1.2958 0.442,-1.94953 l -0.019,0.0372 c 2e-4,-3.5e-4 0.025,-0.0561 0.025,-0.0565 10e-5,-4.5e-4 0,-0.0485 0,-0.0491 0,-5.5e-4 0,-0.0226 -0.01,-0.0312 0,-0.009 -0.01,-0.0165 -0.01,-0.0223 -0.011,-0.0232 -0.02,-0.0322 -0.028,-0.0417 -0.016,-0.019 -0.029,-0.0315 -0.046,-0.0461 -0.033,-0.0293 -0.075,-0.0613 -0.1176,-0.0923 -0.043,-0.031 -0.086,-0.0612 -0.125,-0.0848 -0.02,-0.0118 -0.038,-0.0219 -0.058,-0.0312 -0.01,-0.005 -0.02,-0.009 -0.036,-0.0134 -0.01,-0.002 -0.016,-0.005 -0.028,-0.006 -0.01,-7.6e-4 -0.014,-0.002 -0.022,-0.002 z m 20.5966,3.86483 c -0.01,0.014 -0.068,0.034 -0.055,0.0194 -0.018,-0.0274 -0.4073,0.50245 -0.098,0.12501 -0.018,0.042 -0.037,0.093 -0.054,0.14435 -0.017,0.0514 -0.032,0.1012 -0.042,0.14585 -0.01,0.0223 -0.01,0.0421 -0.01,0.067 -8e-4,0.0124 0,0.0255 0,0.0506 8e-4,0.006 0,0.0138 0.01,0.0223 0,0.009 0.012,0.0293 0.012,0.0298 2e-4,4e-4 0.018,0.0217 0.025,0.0312 0,0.002 0.01,0.008 0.01,0.008 0,10e-6 0,0.002 0,0.002 0.1897,0.19707 0.4279,0.41744 0.6087,0.6548 0.1831,0.24045 0.2988,0.48736 0.2738,0.73219 0,0.0382 -0.033,0.10392 -0.061,0.18156 -0.1434,0.17486 -0.3035,0.34008 -0.4822,0.38098 -0.016,0.004 -0.075,-0.008 -0.1697,-0.0104 -10e-5,0 -0.061,0.0133 -0.061,0.0134 -10e-5,5e-5 -0.043,0.0282 -0.043,0.0283 -2e-4,1.7e-4 -0.033,0.0472 -0.033,0.0476 -10e-5,3.4e-4 -0.01,0.0188 -0.01,0.0253 0,0.007 0,0.0121 0,0.0164 0,0.017 0,0.0244 0,0.0328 10e-5,0.0168 0,0.0312 0,0.0461 0,0.015 0,0.029 0.01,0.0447 0,0.008 0,0.0154 0.01,0.0298 0,0.007 0.016,0.0336 0.016,0.0342 2e-4,3.2e-4 0.034,0.0385 0.034,0.0387 10e-5,8e-5 0.042,0.0238 0.042,0.0238 10e-5,3e-5 0.067,0.009 0.067,0.009 h -0.031 c 0.2534,0.028 0.4793,0.0444 0.7009,-0.008 0.2217,-0.0518 0.4295,-0.17709 0.6236,-0.40181 a 0.14916659,0.14916659 0 0 0 0.025,-0.0417 c 0.046,-0.11117 0.1376,-0.24191 0.1697,-0.42264 0.067,-0.37618 -0.043,-0.73741 -0.2277,-1.0462 -0.1852,-0.30879 -0.4468,-0.56958 -0.7084,-0.76493 -0.1484,-0.11083 -0.3052,-0.18759 -0.439,-0.26937 a 0.14916659,0.14916659 0 0 0 -0.048,0 l 0.016,-0.0119 c -4e-4,-1.4e-4 -0.063,-0.008 -0.064,-0.008 z m -15.5933,0.008 c -0.046,-0.003 -0.1514,0.0886 -0.122,0.0536 a 0.14916659,0.14916659 0 0 0 -0.012,0.0178 c -0.066,0.10611 -0.1579,0.21864 -0.2262,0.36312 -0.2685,0.5684 -0.4323,1.41472 0,2.00906 0.097,0.13317 0.2231,0.18654 0.2902,0.24108 a 0.14916659,0.14916659 0 0 0 0.067,0.0312 c 0.1808,0.0333 0.2117,0.0568 0.3006,0.061 0.044,0.002 0.087,-0.009 0.1235,-0.0208 0.037,-0.0119 0.079,-0.0279 0.1503,-0.0506 a 0.14916659,0.14916659 0 0 0 0.012,-0.005 c 10e-5,-4e-5 0.047,-0.0312 0.048,-0.0312 10e-5,-7e-5 0.025,-0.0341 0.025,-0.0342 1e-4,-2e-4 0.016,-0.0458 0.016,-0.0461 10e-5,-3.3e-4 0,-0.0191 0,-0.0253 2e-4,-0.006 0,-0.0108 0,-0.0149 0,-0.0162 0,-0.0238 0,-0.0312 0,-0.015 -0.01,-0.0263 -0.01,-0.0387 0,-0.0124 -0.01,-0.0236 -0.015,-0.0372 0,-0.007 -0.01,-0.0136 -0.015,-0.0268 0,-0.003 0,-0.007 -0.01,-0.0119 0,-0.005 -0.016,-0.0177 -0.016,-0.0178 -2e-4,-2.2e-4 -0.043,-0.0296 -0.043,-0.0298 -10e-5,-5e-5 -0.046,-0.0119 -0.046,-0.0119 -10e-5,-10e-6 -0.062,0.008 -0.062,0.008 l 0.033,-0.008 c -0.08,0.008 -0.086,0.0116 -0.08,0.0164 0,-0.003 -0.01,-0.007 -0.01,-0.0104 -0.06,-0.13161 -0.1357,-0.29813 -0.1548,-0.39288 -0.1012,-0.50403 0.04,-1.02037 0.2456,-1.512 l -0.012,0.0238 c 2e-4,-3.6e-4 0.022,-0.0561 0.022,-0.0565 10e-5,-4.6e-4 0,-0.0471 0,-0.0476 0,-5.5e-4 0,-0.0227 -0.01,-0.0312 0,-0.009 -0.01,-0.0151 -0.01,-0.0208 -0.012,-0.0231 -0.021,-0.0324 -0.03,-0.0417 -0.017,-0.0186 -0.032,-0.0321 -0.049,-0.0462 -0.034,-0.0281 -0.076,-0.058 -0.1206,-0.0878 -0.044,-0.0298 -0.091,-0.0584 -0.1324,-0.0819 -0.021,-0.0117 -0.04,-0.0222 -0.06,-0.0312 -0.02,-0.009 -0.031,-0.0191 -0.079,-0.0238 0,-1.5e-4 0,2e-4 -0.012,0 z m 16.6067,4.411 c -0.04,-0.005 -0.082,0.0219 -0.082,0.0194 -0.014,-0.002 -0.2264,0.22465 -0.071,0.0789 -0.01,0.0192 -0.019,0.0377 -0.027,0.0581 -0.016,0.0407 -0.031,0.0887 -0.046,0.13692 -0.015,0.0482 -0.029,0.0962 -0.039,0.13691 0,0.0204 -0.01,0.0382 -0.01,0.0565 0,0.009 0,0.0174 0,0.0298 -2e-4,0.005 0,0.0106 0,0.0164 v 0.002 c 10e-5,0.002 -2e-4,0.004 0,0.006 4e-4,0.005 10e-5,0.0104 0,0.0178 0,0.007 0.01,0.0229 0.01,0.0268 10e-5,4.5e-4 0,0.003 0,0.003 a 0.14916659,0.14916659 0 0 0 0,0.002 c 0.1176,0.30067 0.3798,0.53019 0.5893,0.76344 0.2095,0.23324 0.3555,0.44717 0.3319,0.67861 0,0.0383 -0.033,0.10518 -0.061,0.18305 -0.1429,0.17417 -0.3042,0.33844 -0.4836,0.37949 -0.019,0.005 -0.076,-0.006 -0.1682,-0.009 -10e-5,0 -0.062,0.0133 -0.062,0.0134 -10e-5,5e-5 -0.045,0.0312 -0.045,0.0312 -2e-4,1.7e-4 -0.033,0.0517 -0.033,0.0521 -1e-4,3.5e-4 -0.01,0.02 -0.01,0.0268 0,0.007 0,0.0121 0,0.0164 0,0.0171 -5e-4,0.0248 0,0.0328 7e-4,0.016 0,0.0283 0,0.0417 0,0.0267 0.01,0.0521 0.01,0.0521 a 0.14916659,0.14916659 0 0 0 0.1369,0.12352 c 0,0 0.2248,0.0152 0.4955,-0.0253 0.2708,-0.0405 0.6029,-0.13085 0.8215,-0.38396 a 0.14916659,0.14916659 0 0 0 0.025,-0.0417 c 0.046,-0.11117 0.1376,-0.24191 0.1697,-0.42264 0.067,-0.37618 -0.043,-0.73741 -0.2277,-1.0462 -0.1851,-0.30879 -0.4468,-0.56958 -0.7084,-0.76493 -0.1479,-0.11051 -0.3033,-0.18733 -0.4375,-0.26936 a 0.14916659,0.14916659 0 0 0 -0.027,-0.0119 c -3e-4,-1.4e-4 -0.046,-0.009 -0.046,-0.009 z m -21.0043,0.009 c -0.011,0.002 -0.044,0.008 -0.049,0.0104 0,7.7e-4 -0.015,0.006 -0.021,0.009 -2e-4,1.1e-4 0,0.002 0,0.002 -5e-4,2.8e-4 0,0.002 0,0.002 -1e-4,6e-5 -0.036,0.0282 -0.036,0.0283 0,3e-5 -0.01,0.0142 -0.016,0.0253 v -0.005 c 0,0.005 -0.01,0.0117 -0.01,0.0164 -0.066,0.10277 -0.1509,0.20941 -0.2158,0.34674 -0.2685,0.56832 -0.4322,1.41334 0,2.00758 0.096,0.13169 0.2202,0.18686 0.2887,0.24257 a 0.14916659,0.14916659 0 0 0 0.067,0.0312 c 0.1811,0.0334 0.2145,0.0562 0.3036,0.0595 0.044,0.002 0.086,-0.009 0.122,-0.0208 0.036,-0.0119 0.078,-0.0266 0.1488,-0.0492 a 0.14916659,0.14916659 0 0 0 0.013,-0.006 c 10e-5,-4e-5 0.048,-0.0312 0.048,-0.0312 10e-5,-6e-5 0.025,-0.0341 0.025,-0.0342 10e-5,-2e-4 0.016,-0.0488 0.016,-0.0492 10e-5,-3.2e-4 0,-0.019 0,-0.0253 0,-0.006 -8e-4,-0.0107 0,-0.0149 0,-0.0165 0,-0.0238 -0.01,-0.0312 0,-0.0149 -0.01,-0.0265 -0.012,-0.0387 0,-0.0122 -0.01,-0.0238 -0.015,-0.0372 0,-0.007 -0.01,-0.0123 -0.015,-0.0253 0,-0.003 -0.01,-0.007 -0.01,-0.0119 0,-0.005 -0.016,-0.0177 -0.016,-0.0178 -2e-4,-2e-4 -0.043,-0.0267 -0.043,-0.0267 -10e-5,-5e-5 -0.045,-0.0119 -0.045,-0.0119 -10e-5,-10e-6 -0.061,0.008 -0.061,0.008 -0.03,0.002 -0.048,0.006 -0.045,0.009 0,-0.004 -0.01,-0.008 -0.01,-0.0119 -0.06,-0.13248 -0.1374,-0.29781 -0.1562,-0.39139 -0.1012,-0.50378 0.041,-1.02014 0.247,-1.512 l -0.012,0.0238 c 3e-4,-3.9e-4 0.022,-0.0576 0.022,-0.0581 0,-4.8e-4 0,-0.047 0,-0.0476 -10e-5,-5.7e-4 -0.01,-0.0242 -0.01,-0.0328 0,-0.008 -0.01,-0.0152 -0.01,-0.0208 -0.012,-0.0228 -0.021,-0.0323 -0.03,-0.0417 -0.017,-0.0187 -0.033,-0.0315 -0.051,-0.0461 -0.036,-0.0292 -0.08,-0.0601 -0.1265,-0.0908 -0.046,-0.0307 -0.095,-0.0603 -0.1369,-0.0833 -0.021,-0.0115 -0.04,-0.021 -0.061,-0.0298 -0.011,-0.005 -0.02,-0.009 -0.036,-0.0134 -0.01,-0.002 -0.017,-0.003 -0.03,-0.005 -0.01,-5.6e-4 -0.013,-4e-4 -0.022,0 z m 12.3892,4.04639 c -0.057,-0.0117 -0.1126,0.0385 -0.1057,0.0312 -0.6414,0.41304 -1.2395,1.067 -1.3631,1.8781 -0.027,0.17578 0,0.33092 0,0.45985 a 0.14916659,0.14916659 0 0 0 0.01,0.0417 c 0.1189,0.41515 0.3571,0.79627 0.8378,0.91971 0.3558,0.0913 0.664,-0.11699 0.887,-0.22323 10e-5,-5e-5 0.048,-0.0386 0.048,-0.0387 0,-8e-5 0.025,-0.0415 0.025,-0.0417 0,-2.4e-4 0.01,-0.0532 0.01,-0.0536 0,-3.7e-4 0,-0.0203 0,-0.0267 -7e-4,-0.006 0,-0.0123 0,-0.0164 0,-0.0164 -0.01,-0.0236 -0.012,-0.0312 -0.01,-0.0154 -0.012,-0.027 -0.019,-0.0402 -0.01,-0.0132 -0.016,-0.0265 -0.025,-0.0401 0,-0.007 -0.01,-0.0133 -0.019,-0.0253 0,-0.003 -0.01,-0.006 -0.01,-0.0104 0,-0.004 -0.021,-0.0147 -0.021,-0.0149 -4e-4,-2e-4 -0.047,-0.0208 -0.048,-0.0208 -10e-5,-3e-5 -0.047,-0.003 -0.048,-0.003 -10e-5,0 -0.059,0.0178 -0.06,0.0178 l 0.019,-0.009 c -0.085,0.0325 -0.1383,0.0633 -0.1652,0.067 -0.099,0.0133 -0.2439,-0.004 -0.3706,-0.0492 -0.1267,-0.0455 -0.2336,-0.1191 -0.2827,-0.19495 -0.024,-0.037 -0.044,-0.11273 -0.074,-0.19794 10e-5,-0.11303 -0.01,-0.21229 0,-0.28424 0.1031,-0.56517 0.6305,-1.15597 1.0655,-1.59683 l -0.015,0.0132 c 3e-4,-2.1e-4 0.042,-0.0473 0.042,-0.0476 2e-4,-3.2e-4 0.015,-0.0457 0.015,-0.0461 0,-4.2e-4 0,-0.0239 0,-0.0328 -3e-4,-0.009 0,-0.0148 0,-0.0208 0,-0.0242 -0.01,-0.036 -0.014,-0.0462 -0.01,-0.0203 -0.017,-0.0335 -0.027,-0.0491 -0.02,-0.0311 -0.044,-0.0649 -0.07,-0.0982 -0.026,-0.0333 -0.051,-0.0654 -0.076,-0.0923 -0.012,-0.0134 -0.024,-0.0248 -0.042,-0.0387 -0.01,-0.007 -0.018,-0.015 -0.04,-0.0253 -0.01,-0.002 -0.012,-0.005 -0.021,-0.008 -0.01,-0.002 -0.031,-0.006 -0.031,-0.006 z m 12.5633,0.41818 c -0.025,0.003 -0.1066,0.0278 -0.122,0.0372 -0.02,-0.0379 -0.2579,0.59523 -0.067,0.15627 -0.01,0.049 -0.014,0.10777 -0.019,0.16817 -0.01,0.0604 -0.01,0.12124 -0.01,0.17113 -10e-5,0.0249 3e-4,0.0459 0,0.0699 0,0.012 0,0.0232 0.01,0.0447 0,0.005 0,0.012 0.01,0.0194 0,0.008 0.015,0.0263 0.015,0.0267 3e-4,4.5e-4 0.027,0.0261 0.033,0.0312 v -0.002 c 0.1006,0.0824 0.2188,0.18747 0.2946,0.30211 0.076,0.11464 0.1121,0.2247 0.074,0.35865 -0.054,0.19356 -0.1941,0.32075 -0.3438,0.50003 -0.058,0.0642 -0.1502,0.16815 -0.2456,0.26937 -0.097,0.10296 -0.2051,0.20355 -0.244,0.22769 -0.037,0.0232 -0.109,0.0315 -0.2158,0.0655 a 0.14916659,0.14916659 0 0 0 -0.01,0.002 c -10e-5,5e-5 -0.056,0.0386 -0.057,0.0387 -10e-5,10e-5 -0.025,0.037 -0.025,0.0372 0,1.7e-4 -0.01,0.0251 -0.01,0.0253 0,2.3e-4 0,0.013 0,0.0178 0,0.0193 0,0.0267 0,0.0342 8e-4,0.0152 0,0.0245 0,0.0342 0,0.0195 0.01,0.0397 0.012,0.0595 0.01,0.0198 0.012,0.0379 0.018,0.0565 0,0.009 0,0.0184 0.012,0.0328 0,0.004 0,0.007 0.01,0.0119 0,0.005 0.013,0.0204 0.013,0.0208 4e-4,4.1e-4 0.043,0.0356 0.043,0.0357 10e-5,9e-5 0.052,0.0178 0.052,0.0178 1e-4,3e-5 0.076,-0.008 0.076,-0.008 l -0.039,0.009 c 0.3847,-0.0401 0.8035,-0.0626 1.1756,-0.38694 a 0.14916659,0.14916659 0 0 0 0.018,-0.0194 c 0.1244,-0.15471 0.2351,-0.26528 0.3303,-0.40925 0.095,-0.14397 0.1661,-0.31833 0.2039,-0.56849 0.059,-0.38942 -0.044,-0.72384 -0.2321,-0.97327 -0.188,-0.24944 -0.4545,-0.41688 -0.7278,-0.50896 a 0.14916659,0.14916659 0 0 0 -0.027,-0.006 z" /><path
         style="fill:#000000;fill-opacity:1;stroke-width:9.10154;-inkscape-stroke:none;paint-order:markers fill stroke"
         id="path6193"
         d="m 1168.7827,665.73994 c 0.1846,0.0184 0.3682,0.0473 0.5538,0.0557 0.523,0.0238 2.2666,0.0202 2.6216,0.0184 1.8224,-0.009 3.6404,-0.0476 5.4607,-0.1192 0.4397,-0.0327 1.479,-0.067 1.9916,-0.22412 0.4404,-0.13493 0.2114,-0.16739 0.058,-0.22241 0,-3.1e-4 0.01,0.0558 0.015,0.055 v 0 c 0.1729,-0.11302 0.3177,-0.14426 -0.1305,-0.28229 -0.5706,-0.17572 -1.5388,-0.17813 -2.0683,-0.20723 -2.8724,-0.0163 -5.7593,0.0501 -8.5703,0.60743 -0.027,0.005 0.042,0.32274 0.069,0.31862 z" /><path
         style="fill:#000000;fill-opacity:1;stroke-width:7.28328;-inkscape-stroke:none;paint-order:markers fill stroke"
         id="path6194"
         d="m 1168.9419,668.34802 c 0.2415,0.0216 0.4819,0.0528 0.7246,0.0648 2.6439,0.13122 5.3947,-0.0536 8.0185,-0.2962 0.099,-0.0132 1.249,-0.13221 1.5299,-0.25231 0.044,-0.0186 0.066,-0.0842 0.031,-0.11119 -0.093,-0.0715 -0.2236,-0.12051 -0.3546,-0.13735 -0.1803,-0.0232 -0.3653,0.0142 -0.5479,0.0213 -0.016,0.002 0.026,0.17305 0.042,0.17081 v 0 c 0.1814,-0.0116 0.3715,0.009 0.5444,-0.0345 0.1112,-0.0277 0.2157,-0.0908 0.2709,-0.16872 0.025,-0.0346 -0.03,-0.0891 -0.08,-0.10112 -0.3225,-0.0787 -1.4764,-0.0593 -1.6087,-0.0605 -0.5131,0.0138 -1.0266,0.0191 -1.5391,0.0414 -2.359,0.10237 -4.7107,0.31753 -7.0462,0.58231 -0.027,0 -0.011,0.28212 0.016,0.28128 z" /><path
         style="fill:#b586ff;fill-opacity:1;stroke-width:2.96516;-inkscape-stroke:none;paint-order:markers fill stroke"
         d="m 1179.3813,665.27417 c -2.5164,0.28023 -5.0598,0.24752 -7.59,0.34229 -0.9167,0.0695 -1.8776,-0.07 -2.7651,0.12799 -0.2609,0.67085 -0.7173,1.49204 -0.3948,2.21565 0.4324,0.52022 1.141,0.17488 1.7121,0.16332 2.8854,-0.30607 5.7731,-0.39753 8.6741,-0.51925 0.6542,-0.11043 1.3654,-0.48188 1.6836,-1.08323 -0.01,-0.57422 -0.6012,-0.99721 -1.0756,-1.22485 -0.079,-0.0214 -0.1624,-0.027 -0.2443,-0.022 z"
         id="path6195" /><path
         style="fill:#000000;fill-opacity:1;stroke-width:7.85917;-inkscape-stroke:none;paint-order:markers fill stroke"
         id="path6196"
         d="m 1174.3519,672.12583 c 1.7533,0.11419 3.5204,0.1076 5.2808,0.12247 2.8312,0.0239 1.5233,0.0207 4.4353,0.005 1.7002,-0.0446 3.4095,-0.0672 5.0986,-0.21234 0.2418,-0.0208 0.4846,-0.0434 0.7199,-0.0843 0.08,-0.014 0.2068,-0.0261 0.2167,-0.0784 0.011,-0.0587 -0.1169,-0.0922 -0.1754,-0.1383 -0.5593,0.008 -0.2561,0.007 -0.9096,-0.002 -0.015,0.002 0.021,0.13901 0.036,0.13739 v 0 c 0.6459,-0.0295 0.345,-0.0196 0.9024,-0.0328 0.034,-0.0485 0.1357,-0.097 0.1013,-0.1452 -0.038,-0.0543 -0.1651,-0.061 -0.257,-0.0734 -0.2496,-0.0338 -0.5047,-0.0501 -0.759,-0.0641 -1.7174,-0.0943 -3.4456,-0.068 -5.1667,-0.0667 -1.6622,0.031 -2.7611,0.0466 -4.4117,0.0964 -1.5138,0.0457 -3.0315,0.0984 -4.5317,0.24131 -0.2114,0.0201 -0.4202,0.0497 -0.6303,0.0744 -0.025,0.002 0.025,0.22253 0.05,0.22028 z" /><path
         style="fill:#86bfff;fill-opacity:1;stroke-width:2.96516;-inkscape-stroke:none;paint-order:markers fill stroke"
         d="m 1174.3312,669.56881 c -0.5634,0.13751 -0.5255,0.90012 -0.5763,1.36243 -0.068,0.53988 0.2508,1.1798 0.8474,1.16453 3.741,-0.38587 7.5117,-0.24717 11.2703,-0.32007 1.3537,-0.0646 2.7378,0.0826 4.0747,-0.14965 0.5207,-0.34892 0.016,-1.03311 -0.2854,-1.36609 -0.3192,-0.37346 -0.6564,-0.86148 -1.2233,-0.65048 -3.9885,0.20942 -8.0226,0.25318 -12.0226,0.10867 -0.6932,-0.0409 -1.3928,-0.0737 -2.0848,-0.14934 z"
         id="path6197" /><path
         style="fill:#000000;fill-opacity:1;stroke-width:7.85917;-inkscape-stroke:none;paint-order:markers fill stroke"
         id="path6198"
         d="m 1169.9635,676.54511 c 1.7534,0.11419 3.5205,0.1076 5.2809,0.12246 2.8312,0.0239 6.9021,0.0207 9.8141,0.005 1.7002,-0.0446 3.4095,-0.0672 5.0986,-0.21234 0.2418,-0.0208 0.4845,-0.0434 0.7199,-0.0843 0.08,-0.014 0.2068,-0.0261 0.2167,-0.0784 0.011,-0.0587 -0.1169,-0.0922 -0.1754,-0.1383 -0.5593,0.008 -0.2561,0.007 -0.9096,-0.002 -0.015,0.002 0.036,0.13739 0.036,0.13739 v 0 c 0,0 0.345,-0.0196 0.9024,-0.0328 0.034,-0.0485 0.1357,-0.097 0.1013,-0.1452 -0.039,-0.0543 -0.1651,-0.061 -0.257,-0.0735 -0.2496,-0.0338 -0.5047,-0.0501 -0.759,-0.0641 -1.7174,-0.0943 -3.4456,-0.068 -5.1667,-0.0667 -1.6622,0.031 -8.14,0.0466 -9.7905,0.0964 -1.5138,0.0457 -3.0315,0.0984 -4.5317,0.24131 -0.2114,0.0201 -0.4202,0.0497 -0.6303,0.0744 -0.025,0.002 0.025,0.22253 0.05,0.22028 z"
         sodipodi:nodetypes="cscsssccsscssscssccc" /><path
         style="fill:#cb86ff;fill-opacity:1;stroke-width:2.96516;-inkscape-stroke:none;paint-order:markers fill stroke"
         d="m 1169.6485,674.04469 c -0.2534,0.65521 -0.4959,1.55421 -0.052,2.18548 0.2687,0.27067 0.6404,0.34341 1.0173,0.23715 4.0699,-0.32834 8.1625,-0.22011 12.2459,-0.28067 2.6949,-0.0494 5.3999,0.0464 8.0883,-0.14192 0.5589,-0.22934 2e-4,-0.8655 -0.2136,-1.14803 -0.3174,-0.36502 -0.5364,-1.05111 -1.1506,-0.84812 -5.7058,0.19288 -11.4327,0.1039 -17.1475,0.0653 -0.9034,0.014 -1.7865,-0.0755 -2.6805,-0.10316 l -0.089,0.0283 z"
         id="path6199" /><path
         style="fill:#000000;fill-opacity:1;stroke-width:6.66776;-inkscape-stroke:none;paint-order:markers fill stroke"
         id="path6200"
         d="m 1173.96,669.74548 c 0.2206,0.0257 0.4396,0.0577 0.6617,0.0774 2.7607,0.24476 5.5683,0.21919 8.3478,0.20191 1.645,-0.0252 3.2909,-0.0696 4.9302,-0.16219 0.5586,-0.0316 1.1497,-0.0591 1.6956,-0.15144 -0.059,-0.0509 -0.093,-0.11883 -0.1778,-0.15279 -0.077,-0.031 -0.5305,0.0709 -0.6565,0.0796 0,0 0.01,0.0327 0.01,0.0323 v 0 c 0.1201,0.005 0.6447,0.0756 0.7064,0.0339 0.064,-0.0435 0.053,-0.11436 0.079,-0.17154 -0.5735,-0.097 -1.1918,-0.11261 -1.7804,-0.13207 -1.659,-0.0549 -3.322,-0.052 -4.9826,-0.0404 -1.9449,0.0283 -3.8866,0.0734 -5.8304,0.12282 -0.7946,0.0202 -1.5901,0.0287 -2.3842,0.0563 -0.213,0.008 -0.4252,0.0219 -0.6378,0.0329 -0.019,0.002 0,0.17426 0.02,0.17336 z" /><path
         style="fill:#eeff86;fill-opacity:1;stroke-width:2.96516;-inkscape-stroke:none;paint-order:markers fill stroke"
         d="m 1182.6453,678.53845 c -0.5611,0.0553 -1.3334,-0.17227 -1.5687,0.52308 -0.4305,0.4712 -0.5736,1.3842 0.1195,1.69204 0.2934,0.14224 0.6168,-0.0736 0.8341,0.20773 0.7345,0.0553 1.4655,-0.14275 2.212,-0.12237 3.157,-0.16375 6.345,-0.0331 9.498,-0.0949 0.4132,-0.33141 1.059,-0.81452 0.9444,-1.4265 -0.3108,-0.75002 -1.266,-0.4753 -1.8941,-0.54843 -3.3869,0.0272 -6.7598,-0.18484 -10.1452,-0.23064 z"
         id="path6201" /><path
         style="fill:#000000;fill-opacity:1;stroke-width:6.66776;-inkscape-stroke:none;paint-order:markers fill stroke"
         id="path6202"
         d="m 1169.5717,674.16475 c 0.2205,0.0258 0.4395,0.0577 0.6617,0.0774 2.7607,0.24477 10.9471,0.2192 13.7266,0.20191 1.645,-0.0252 3.2908,-0.0696 4.9302,-0.16219 0.5586,-0.0315 1.1497,-0.0591 1.6955,-0.15143 -0.059,-0.0509 -0.093,-0.11883 -0.1777,-0.15279 -0.077,-0.031 -0.5305,0.0709 -0.6565,0.0796 0,0 0.01,0.0323 0.01,0.0323 v 0 c 0,0 0.6447,0.0756 0.7063,0.0339 0.064,-0.0435 0.053,-0.11436 0.079,-0.17154 -0.5734,-0.097 -1.1917,-0.11262 -1.7803,-0.13208 -1.6591,-0.0549 -3.322,-0.052 -4.9826,-0.0404 -1.9449,0.0283 -9.2654,0.0734 -11.2092,0.12282 -0.7947,0.0202 -1.5901,0.0287 -2.3842,0.0563 -0.213,0.008 -0.4252,0.0219 -0.6378,0.0329 -0.019,0.002 0,0.17427 0.02,0.17337 z"
         sodipodi:nodetypes="sccscssssscscsscss" /><path
         style="opacity:0.4;fill:#000000;fill-opacity:1;stroke-width:8.38675;-inkscape-stroke:none;paint-order:markers fill stroke"
         d="m 1151.295,688.04911 c 11.6547,4.47518 27.8441,1.78972 41.5016,1.75853 0,0 1.1226,-1.77459 1.8709,-3.27128 0.7483,-1.49673 -0.9969,-24.02486 -0.9969,-24.02486 l 2.3386,-4.49014 1.4967,2.33863 1.3097,16.65089 0.187,12.72201 -4.0224,3.83533 -2.0579,0.56126 -34.8921,0.37419 -5.332,-1.87089 -1.2161,-2.7128 z"
         id="path6203"
         sodipodi:nodetypes="ccsccccccccccc" /><path
         style="fill:#ff8686;fill-opacity:1;stroke-width:2.96516;-inkscape-stroke:none;paint-order:markers fill stroke"
         d="m 1180.3473,684.50703 c -3.352,0.38296 -6.765,0.3715 -10.1468,0.28308 -0.7847,-0.009 -1.5759,-0.0872 -2.3579,-0.0241 -0.4519,0.31345 -0.2298,1.01584 -0.151,1.46931 0.1068,0.28067 0.3199,0.46585 0.4227,0.72806 0.7513,0.27201 1.6063,0.068 2.3954,0.12115 3.3964,-0.0865 6.7989,-0.0645 10.1907,-0.26128 0.6746,0.0124 1.1144,-0.78155 0.7424,-1.34651 -0.2409,-0.42657 -0.5061,-1.01945 -1.0955,-0.96962 z"
         id="path6204" /><path
         style="fill:#000000;fill-opacity:1;stroke-width:10.9049;-inkscape-stroke:none;paint-order:markers fill stroke"
         id="path6205"
         d="m 1181.2471,678.71911 c 0.227,0.0126 0.4537,0.0302 0.6811,0.0374 1.2474,0.0393 0.9244,-0.005 2.2987,0.017 1.792,0.0287 3.5827,0.13121 5.3718,0.2111 1.41,0.0149 2.8345,0.0862 4.2392,-0.0607 0.1609,-0.017 0.3291,-0.028 0.4753,-0.0849 0.051,-0.0197 0.1,-0.0883 0.067,-0.12553 -0.082,-0.0941 -0.2335,-0.13252 -0.3503,-0.1988 -0.145,2.1e-4 -0.2901,0 -0.435,0 -0.013,0 0.01,0.1473 0.019,0.14619 v 0 c 0.1443,0.0145 0.2886,0.029 0.4329,0.0437 0.1553,-0.13333 0.2819,-0.21497 0.1849,-0.24794 -0.1539,-0.0523 -0.3273,-0.0556 -0.4928,-0.0737 -0.3348,-0.0367 -0.6707,-0.0667 -1.0073,-0.0904 -1.0815,-0.0761 -2.1778,-0.11448 -3.2608,-0.16084 -2.763,-0.0754 -5.5508,-0.11235 -8.281,0.29858 -0.025,0.002 0.032,0.29148 0.057,0.28824 z" /><path
         style="fill:#86bfff;fill-opacity:1;stroke-width:2.96516;-inkscape-stroke:none;paint-order:markers fill stroke"
         d="m 1170.4018,689.52078 c -1.5136,0.30607 -3.0804,0.11464 -4.6208,0.16748 -0.8862,0.0489 -1.8141,-0.11139 -2.6738,0.0708 -0.309,0.56565 -0.9788,1.21489 -0.73,1.91382 0.2767,0.23407 0.6962,0.19841 1.0546,0.19293 2.3446,-0.20222 4.7292,-0.18058 7.09,-0.0809 0.6782,-0.11195 1.3206,-0.99953 0.7738,-1.6087 -0.2403,-0.26641 -0.494,-0.65799 -0.8938,-0.65537 z"
         id="path6206" /><path
         style="fill:#000000;fill-opacity:1;stroke-width:9.21385;-inkscape-stroke:none;paint-order:markers fill stroke"
         id="path6207"
         d="m 1180.5588,681.2956 c 0.1863,0.0172 0.3719,0.0405 0.5588,0.0517 0.3688,0.0219 2.1236,0.0773 2.3027,0.0819 1.9554,0.0504 3.909,0.0606 5.8652,0.0552 1.1307,-0.0423 2.1035,-0.0552 3.214,-0.17375 0.2784,-0.0297 0.56,-0.0598 0.8273,-0.13092 0.1077,-0.0286 0.2523,-0.0712 0.2769,-0.16269 0.059,-0.2209 -0.3796,-0.21026 -0.6551,-0.24191 -0.013,0.002 0.016,0.16008 0.03,0.15833 v 0 c 0.149,-0.0145 0.3105,0.008 0.4471,-0.0433 0.065,-0.0243 0.1347,-0.1115 0.093,-0.15973 -0.07,-0.0811 -0.2131,-0.0988 -0.331,-0.11761 -0.2848,-0.0453 -0.5761,-0.0581 -0.8655,-0.0728 -1.0572,-0.0539 -2.1965,-0.0496 -3.2477,-0.0584 -1.9486,0.0209 -3.8893,0.0581 -5.8318,0.19944 -0.5553,0.0405 -1.6248,0.13878 -2.2372,0.22842 -0.1702,0.0248 -0.3367,0.0648 -0.5051,0.0972 -0.025,0.004 0.034,0.29248 0.058,0.28906 z" /><path
         style="fill:#000000;fill-opacity:1;stroke-width:8.38675;-inkscape-stroke:none;paint-order:markers fill stroke"
         id="path6208"
         d="m 1167.678,684.88101 c 2.9332,0.23985 5.8853,0.20593 8.8258,0.15463 1.2491,-0.0932 2.5278,-0.067 3.7616,-0.32411 0.1121,-0.0233 0.3364,0 0.3244,-0.11328 -0.045,-0.42227 -0.5796,-0.3497 -0.8083,-0.35882 -0.3996,-0.003 -0.7811,0.0545 -1.1496,0.20497 0,0 0.01,0.0449 0.01,0.0442 v 0 c 0.399,0.10467 0.7995,0.16333 1.2151,0.13642 0.1167,-0.009 0.7843,0.0486 0.6572,-0.38145 -0.035,-0.11904 -0.2392,-0.0699 -0.3623,-0.0862 -1.2727,-0.16817 -2.5669,-0.0995 -3.8452,-0.1289 -2.8969,0.0613 -5.8189,0.061 -8.6845,0.53641 -0.022,0.004 0.034,0.3201 0.056,0.31615 z" /><path
         id="path6209"
         style="stroke-width:9.29797;paint-order:markers fill stroke"
         d="m 1180.4245,683.78324 c -0.047,0.002 -0.024,0.004 -0.043,0.008 -0.038,0.0145 -0.04,0.0248 -0.052,0.0357 -0.012,0.0108 -0.024,0.0226 -0.036,0.0357 -0.024,0.0263 -0.052,0.0573 -0.077,0.0893 -0.025,0.032 -0.05,0.0639 -0.069,0.0923 -0.01,0.0142 -0.016,0.0269 -0.024,0.0431 0,0.008 -0.01,0.0165 -0.012,0.0328 -8e-4,0.004 0,0.009 0,0.0149 -5e-4,0.005 0,0.0189 0,0.0194 10e-5,4.6e-4 0.01,0.0294 0.01,0.0298 2e-4,3.7e-4 0.019,0.0354 0.019,0.0357 a 0.10982057,0.10982057 0 0 0 0,0.005 c 0.4487,0.48629 1.0025,0.91439 1.2188,1.57302 0.023,0.07 0.025,0.17055 0.039,0.2768 -0.026,0.0764 -0.044,0.14883 -0.065,0.18156 -0.049,0.0734 -0.1937,0.20683 -0.3437,0.31699 -0.15,0.11016 -0.3163,0.20542 -0.384,0.22769 -0.059,0.0194 -0.1488,0.002 -0.2679,0.008 a 0.10982057,0.10982057 0 0 0 -0.03,0.006 c -2e-4,6e-5 -0.042,0.0252 -0.042,0.0253 -2e-4,1.2e-4 -0.019,0.0236 -0.019,0.0238 -10e-5,1.9e-4 -0.01,0.0176 -0.01,0.0178 -10e-5,2.7e-4 0,0.01 0,0.0134 0,0.014 0,0.0205 0,0.0268 -6e-4,0.0127 -7e-4,0.0213 0,0.0312 0,0.02 0,0.0418 0.01,0.064 0,0.0222 0.01,0.0446 0.012,0.064 0,0.01 0,0.0175 0.01,0.0298 0,0.006 0,0.013 0.013,0.0268 0,0.004 0.01,0.0117 0.01,0.0119 2e-4,1.9e-4 0.016,0.0162 0.016,0.0164 2e-4,1.2e-4 0.036,0.0193 0.036,0.0194 2e-4,4e-5 0.056,0.002 0.057,0.002 l -0.028,0.003 c 0.2595,0.0104 0.551,0.0248 0.8319,-0.0461 0.2809,-0.0709 0.5511,-0.23674 0.7352,-0.56254 0.094,-0.1658 0.108,-0.34905 0.1503,-0.48961 a 0.10982057,0.10982057 0 0 0 0,-0.0417 c -0.016,-0.15607 0,-0.33713 -0.053,-0.52087 -0.2212,-0.82424 -0.9388,-1.42918 -1.5507,-1.73226 l 0.028,0.0209 c -2e-4,-1.9e-4 -0.041,-0.0267 -0.042,-0.0268 -3e-4,-9e-5 -0.037,-0.006 -0.037,-0.006 z m -12.9815,0.82445 c -0.015,0.002 -0.058,0.01 -0.064,0.0119 -0.03,0.0133 -0.072,0.10456 -0.062,0.0729 -0.2168,0.61228 -0.2678,1.3196 0.088,1.91679 0.053,0.089 0.1199,0.14983 0.1652,0.20537 a 0.10982057,0.10982057 0 0 0 0.033,0.0267 c 0.1273,0.0697 0.2276,0.11299 0.3378,0.0967 0.1092,-0.0161 0.1863,-0.0873 0.2724,-0.17858 0,-4e-5 0.022,-0.0327 0.022,-0.0328 0,-4e-5 0.01,-0.0282 0.01,-0.0283 0,-1.3e-4 0,-0.0355 0,-0.0357 0,-1.8e-4 0,-0.0176 0,-0.0178 0,-2.2e-4 0,-0.008 0,-0.0104 0,-0.0107 -0.01,-0.0136 -0.011,-0.0178 -0.01,-0.008 -0.01,-0.0148 -0.015,-0.0208 0,-0.006 -0.01,-0.0124 -0.016,-0.0194 0,-0.004 -0.01,-0.007 -0.016,-0.0134 0,-0.002 -0.01,-0.006 -0.01,-0.006 -2e-4,-1.1e-4 -0.016,-0.008 -0.016,-0.008 -10e-5,-6e-5 -0.037,-0.009 -0.037,-0.009 0,0 -0.033,0.005 -0.033,0.005 0,0 0,-4e-5 0,0 -0.01,0.002 -0.012,0.003 -0.021,0.005 a 0.10982057,0.10982057 0 0 0 -0.01,-0.0149 c -0.3149,-0.49667 -0.2831,-1.10193 -0.1726,-1.69058 v 0.009 c 10e-5,-3.4e-4 0,-0.0413 0,-0.0417 0,-3.6e-4 -0.01,-0.0323 -0.01,-0.0328 -2e-4,-3.9e-4 -0.01,-0.0153 -0.012,-0.0208 0,-0.005 -0.01,-0.01 -0.011,-0.0134 -0.013,-0.0144 -0.022,-0.0203 -0.03,-0.0253 -0.016,-0.0101 -0.031,-0.0158 -0.046,-0.0223 -0.031,-0.0131 -0.068,-0.0264 -0.1072,-0.0387 -0.079,-0.0248 -0.1523,-0.0475 -0.2232,-0.0506 z m 3.4988,4.55089 c -0.023,0.002 -0.085,0.0331 -0.066,0.0194 -0.012,0.007 -0.02,0.014 -0.028,0.0208 -0.016,0.0136 -0.032,0.0286 -0.049,0.0462 -0.034,0.035 -0.072,0.0783 -0.1086,0.12352 -0.037,0.0452 -0.072,0.0902 -0.098,0.12947 -0.013,0.0197 -0.024,0.0383 -0.034,0.0581 0,0.01 -0.01,0.0195 -0.013,0.0372 0,0.009 0,0.0199 0,0.0372 5e-4,0.009 0.01,0.0307 0.01,0.0312 10e-5,5.2e-4 0.022,0.0369 0.022,0.0372 a 0.10982057,0.10982057 0 0 0 0.01,0.006 c 0.1429,0.13917 0.3432,0.32008 0.5015,0.52236 0.1583,0.20227 0.2661,0.41939 0.25,0.62207 0,0.0251 -0.032,0.0736 -0.061,0.14286 -0.1963,0.26865 -0.4066,0.49846 -0.6727,0.61462 -0.066,0.0287 -0.1527,0.0368 -0.2559,0.0625 a 0.10982057,0.10982057 0 0 0 -0.019,0.008 c -10e-5,6e-5 -0.037,0.0281 -0.037,0.0283 -1e-4,1.3e-4 -0.018,0.0266 -0.018,0.0268 -10e-5,1.9e-4 -0.01,0.0191 -0.01,0.0194 -10e-5,2.4e-4 0,0.01 0,0.0134 0,0.0147 -5e-4,0.022 0,0.0283 8e-4,0.0125 0,0.0207 0,0.0298 0,0.0181 0.01,0.0373 0.015,0.0565 0.01,0.0193 0.011,0.038 0.018,0.0551 0,0.009 0.01,0.0152 0.012,0.0267 0,0.003 0,0.007 0.01,0.0104 0,0.004 0.011,0.0145 0.012,0.0149 4e-4,4.1e-4 0.032,0.0251 0.033,0.0253 2e-4,8e-5 0.039,0.0104 0.039,0.0104 2e-4,2e-5 0.052,-0.008 0.052,-0.008 l -0.024,0.008 c 0.3516,-0.0536 0.7917,-0.0877 1.1414,-0.33037 0.1445,-0.10025 0.2342,-0.2426 0.3274,-0.3408 a 0.10982057,0.10982057 0 0 0 0.022,-0.0387 c 0.049,-0.13715 0.1464,-0.28617 0.1696,-0.48217 0.046,-0.39277 -0.1103,-0.74166 -0.3319,-1.01941 -0.2215,-0.27777 -0.508,-0.49085 -0.7485,-0.63398 l 0.025,0.0209 c -4e-4,-3.8e-4 -0.035,-0.0265 -0.036,-0.0268 -2e-4,-1.4e-4 -0.016,-0.008 -0.016,-0.008 -3e-4,-7e-5 -0.022,-0.004 -0.028,-0.005 z m -7.9231,0.20686 c -0.011,0.006 -0.048,0.0155 -0.037,0.009 0,0.002 -0.01,0.003 -0.01,0.003 a 0.10982057,0.10982057 0 0 0 -0.031,0.0208 c -0.4765,0.45669 -1.0041,1.06557 -1.0194,1.80666 0,0.12314 0.031,0.22584 0.043,0.31253 a 0.10982057,0.10982057 0 0 0 0.01,0.0357 c 0.1051,0.20536 0.2343,0.33181 0.3944,0.37502 0.16,0.0432 0.3246,0.007 0.5164,-0.0476 a 0.10982057,0.10982057 0 0 0 0.013,-0.005 c 10e-5,-3e-5 0.037,-0.0252 0.037,-0.0253 0,-7e-5 0.019,-0.0282 0.019,-0.0283 10e-5,-2e-4 0.01,-0.0369 0.01,-0.0372 10e-5,-3.3e-4 3e-4,-0.0146 0,-0.0194 -2e-4,-0.005 -7e-4,-0.008 0,-0.0104 0,-0.0123 0,-0.0189 0,-0.0253 0,-0.0127 -0.01,-0.0241 -0.014,-0.0357 0,-0.0115 -0.01,-0.0212 -0.016,-0.0328 0,-0.006 0,-0.0125 -0.012,-0.0223 0,-0.002 0,-0.004 -0.01,-0.008 0,-0.004 -0.013,-0.0132 -0.014,-0.0134 -2e-4,-2e-4 -0.033,-0.0193 -0.033,-0.0194 -10e-5,-4e-5 -0.034,-0.008 -0.034,-0.008 -1e-4,-10e-6 -0.046,0.009 -0.046,0.009 l 0.022,-0.008 c -0.12,0.0223 -0.1742,0.0215 -0.1949,0.0119 -0.019,-0.009 -0.051,-0.0525 -0.097,-0.14286 0,-0.0642 -0.013,-0.12365 -0.01,-0.1637 0.06,-0.55133 0.536,-1.00045 0.8438,-1.52093 l -0.018,0.0223 c 3e-4,-2.6e-4 0.025,-0.0383 0.025,-0.0387 10e-5,-3.6e-4 0.01,-0.0338 0.01,-0.0342 0,-4.6e-4 8e-4,-0.0172 0,-0.0238 -8e-4,-0.007 0,-0.0117 0,-0.0164 -0.01,-0.0184 -0.01,-0.0274 -0.015,-0.0357 -0.01,-0.0167 -0.018,-0.029 -0.03,-0.0431 -0.023,-0.0284 -0.052,-0.0607 -0.082,-0.0923 -0.03,-0.0315 -0.062,-0.0629 -0.091,-0.0878 -0.014,-0.0124 -0.027,-0.0226 -0.042,-0.0328 -0.01,-0.005 -0.015,-0.009 -0.025,-0.0149 -0.01,-0.003 -0.012,-0.006 -0.021,-0.009 0,-0.002 -0.01,-0.003 -0.015,-0.005 -0.01,-7.6e-4 -0.023,-0.002 -0.024,-0.002 z" /><path
         style="fill:#000000;fill-opacity:1;stroke-width:7.85315;-inkscape-stroke:none;paint-order:markers fill stroke"
         id="path6210"
         d="m 1167.7094,687.15878 c 2.0241,0.39069 4.1147,0.49248 6.1828,0.49155 0.6097,0 1.2191,-0.0249 1.8286,-0.0374 1.4417,-0.055 2.8866,-0.13757 4.3162,-0.31755 0.2555,-0.0322 0.8823,-0.10493 1.1732,-0.24529 0.047,-0.023 0.063,-0.0771 0.094,-0.11561 -0.2617,-0.18877 -0.092,-0.11813 -0.4594,-0.1477 -0.1059,-0.009 -0.2113,-0.0207 -0.317,-0.0309 -0.01,0 0.01,0.11743 0.016,0.11643 v 0 c 0.1055,0.005 0.2111,0.009 0.3166,0.0137 0.088,0.004 0.1775,0.0264 0.2637,0.0109 0.044,-0.008 0.069,-0.051 0.1038,-0.0766 -0.3147,-0.11017 -1.0885,-0.10082 -1.3519,-0.10523 -1.4529,-0.0244 -2.9068,0.0276 -4.3589,0.055 -2.6131,0.055 -5.2262,0.11272 -7.8402,0.10581 -0.023,0.002 0.01,0.2847 0.032,0.2827 z" /><path
         style="fill:#000000;fill-opacity:1;stroke-width:8.38675;-inkscape-stroke:none;paint-order:markers fill stroke"
         id="path6211"
         d="m 1163.36,689.84097 c 1.7866,0.0926 3.5727,0.15733 5.3616,0.11621 0.5344,-0.0441 0.9798,-0.0532 1.4931,-0.18243 0.1752,-0.0441 0.4549,-0.14337 0.4264,-0.25503 -0.014,-0.0543 -0.094,-0.0612 -0.1406,-0.0918 0,-2e-5 0,0.0521 0,0.0521 v 0 c 0.033,-0.0114 0.1086,0 0.1001,-0.0337 -0.01,-0.0408 -0.077,-0.0356 -0.1188,-0.0422 -0.1225,-0.0193 -0.2465,-0.0287 -0.3704,-0.0354 -0.4109,-0.0219 -1.1342,-0.023 -1.5094,-0.0265 -1.0779,-0.0138 -1.0891,-0.0206 -2.1939,-0.005 -1.0409,0.0143 -2.1018,0.0122 -3.1162,0.27675 -0.016,0.005 0.053,0.23228 0.069,0.22741 z" /><path
         style="fill:#000000;fill-opacity:1;stroke-width:6.89941;-inkscape-stroke:none;paint-order:markers fill stroke"
         id="path6212"
         d="m 1170.9434,691.95233 c -0.2185,0.0222 -0.4362,0.0513 -0.6555,0.067 -0.6112,0.0438 -1.8149,0.0842 -2.3692,0.1005 -1.3202,0.0391 -2.639,0.0534 -3.9592,0.0569 -0.315,-0.005 -0.9013,0.0181 -1.252,-0.068 -0.045,-0.011 -0.1135,-0.0405 -0.1007,-0.0762 0.093,-0.26011 0.2745,-0.18063 0.5191,-0.19295 0.1297,-0.006 0.2587,-0.0206 0.388,-0.0309 0.011,7.6e-4 -0.01,0.12854 -0.021,0.12749 v 0 c -0.1282,0.006 -0.2568,0.007 -0.3845,0.0174 -0.164,0.0137 -0.4372,0.14093 -0.4467,-0.11481 0,-0.0382 0.069,-0.059 0.1146,-0.072 0.3749,-0.1061 0.9545,-0.14599 1.3057,-0.18475 0.3867,-0.0259 0.7729,-0.0587 1.1601,-0.0776 1.9261,-0.0934 3.856,-0.0512 5.7646,0.14035 0.028,0.003 -0.035,0.31033 -0.063,0.3072 z" /><path
         style="fill:#ffaaaa;fill-opacity:1;stroke-width:2.96516;-inkscape-stroke:none;paint-order:markers fill stroke"
         d="m 1170.108,661.18819 c -0.2153,0.0321 -0.2649,0.3374 -0.5284,0.1688 -1.4812,-0.1443 -2.9754,0.0937 -4.4586,0.14806 -0.8385,0.12404 -1.7548,0.0354 -2.5389,0.38307 -0.3304,0.30519 -0.6433,0.7275 -0.7024,1.17752 0.2702,0.477 0.9622,0.15492 1.4018,0.20143 1.7379,-0.0708 3.4912,-0.21132 5.2216,-0.10589 0.3397,0.0323 0.6676,-0.0982 1.01,-0.0721 0.5807,-0.21839 1.2993,-0.54343 1.4949,-1.17827 -0.033,-0.39026 -0.5376,-0.71385 -0.9,-0.72258 z"
         id="path6213" /><path
         style="fill:#000000;fill-opacity:1;stroke-width:8.38675;-inkscape-stroke:none;paint-order:markers fill stroke"
         id="path6214"
         d="m 1159.2011,657.73824 c -0.2498,0.89426 -0.4204,1.81374 -0.5106,2.73815 -0.089,0.90803 -0.095,1.81329 -0.1199,2.72442 -0.01,2.55052 0.1517,5.0971 0.1972,7.64638 -0.017,1.855 -0.1095,3.70747 -0.083,5.56289 0.065,1.89827 0.1174,3.7958 0.1074,5.69534 0.01,2.09423 0.047,4.18746 0.1513,6.27916 0.045,1.45361 0.2502,2.87931 0.4675,4.31312 0.048,0.33322 0.092,0.66714 0.1215,1.00266 0.012,0.14376 0.01,0.3271 0.072,0.46456 0.026,0.0546 0.075,0.095 0.1119,0.14257 0.01,0.009 0.02,0.0178 0.03,0.0266 0,0.002 0.029,0.0279 0.031,0.0258 v 0 c 0.019,-0.005 0.039,-0.0107 0.059,-0.016 0.046,-0.0305 0.1055,-0.0466 0.1374,-0.0913 0.086,-0.12006 0.078,-0.3406 0.08,-0.46846 0.01,-0.33582 -0.024,-0.67082 -0.04,-1.00591 -0.027,-1.41012 -0.036,-2.82058 -0.087,-4.23022 -0.093,-2.08489 -0.1491,-4.17141 -0.1987,-6.25765 -0.051,-1.90186 -0.1256,-3.80326 -0.1598,-5.70534 -0.014,-1.90477 0.02,-3.80838 0.1329,-5.71031 0.022,-1.12195 0.062,-2.24359 0.075,-3.36567 0.015,-1.23678 0.01,-1.52422 -0.017,-2.7835 -0.011,-0.48456 -0.026,-0.96899 -0.039,-1.45345 -0.017,-0.47218 -0.038,-0.9442 -0.051,-1.41649 -0.037,-1.36338 0.019,-2.74758 -0.2333,-4.09393 5e-4,-0.0167 -0.2327,-0.0399 -0.2343,-0.0233 z" /><g
         id="g6412"
         transform="matrix(0.76195362,0,0,0.76195362,580.81288,441.33912)"><path
           style="opacity:1;fill:#fff7b1;fill-opacity:1;stroke-width:3.89152;-inkscape-stroke:none;paint-order:markers fill stroke"
           d="m 800.83845,336.57278 c -0.69407,0.31339 -1.47741,0.32718 -2.20426,0.46635 -0.46448,0.42051 0.0643,1.21171 -0.003,1.75973 0.35246,3.29815 0.6023,6.59325 0.55813,9.91341 0.39471,0.88252 0.99725,-0.3321 1.25299,-0.72167 1.0727,-1.49062 2.03148,-3.19534 3.57313,-4.26964 0.42441,-0.25984 0.529,0.50812 0.84572,0.66133 1.39748,1.44564 2.56592,3.11699 3.61657,4.80897 0.82182,0.32367 0.50198,-0.99819 0.57694,-1.46617 0.0711,-3.51708 0.0936,-7.03629 0.51799,-10.50296 -0.20849,-0.76828 -1.0244,-0.0858 -1.531,-0.11463 -0.57302,0.21158 -1.1776,-0.23147 -1.7118,0.0357 -0.66116,0.78224 -1.70164,1.07038 -2.69652,0.8269 -1.01291,-0.0722 -1.73285,-0.82887 -2.51661,-1.3621 -0.0885,-0.0323 -0.18415,-0.0453 -0.27794,-0.0352 z"
           id="path6215" /><g
           id="g6223"
           transform="matrix(0.72666466,0,0,0.72666466,188.90797,92.552278)"><path
             style="opacity:1;fill:#fff7b1;fill-opacity:1;stroke-width:11.2069;-inkscape-stroke:none;paint-order:markers fill stroke"
             d="m 4336.1023,3052.8126 c -6.3281,1.0266 -10.2633,7.0587 -12.6954,12.4891 -3.8837,9.0186 -4.979,20.3811 0.9611,28.7841 4.9049,6.3727 13.2297,9.6795 21.185,8.8301 10.1086,0.095 20.4372,-5.4333 24.6586,-14.8536 3.4996,-7.2946 0.3766,-16.07 -5.1656,-21.4335 -7.2183,-7.3782 -17.7234,-10.7835 -27.9114,-10.4632 -0.9619,0.015 -1.9274,0.053 -2.8788,0.2053 1.1404,-1.234 2.9112,-1.3496 4.1957,-2.247 0.4867,-1.6394 -1.2884,-1.5608 -2.3492,-1.3113 z"
             id="path6216"
             transform="matrix(0.34724336,0,0,0.34724336,-663.2572,-746.26907)" /><path
             style="opacity:1;fill:#000000;fill-opacity:1;stroke-width:11.0069;-inkscape-stroke:none;paint-order:markers fill stroke"
             id="path6217"
             d="m 843.99216,313.77237 c -0.19106,-0.11758 -0.3636,-0.27269 -0.57313,-0.35277 -1.83893,-0.70271 -3.86662,0.58775 -5.02482,1.9329 -0.50819,0.59021 -0.86818,1.29338 -1.30223,1.94005 -0.32092,0.78765 -0.72286,1.54697 -0.9627,2.36295 -0.74751,2.54308 -0.79953,5.36596 0.39284,7.7951 1.01857,2.07516 1.72111,2.31003 3.47212,3.6822 0.91346,0.3786 1.78469,0.882 2.74041,1.13573 0.867,0.23019 1.77712,0.30182 2.67419,0.30182 2.60064,0 5.24098,-0.82661 7.267,-2.4839 0.62209,-0.50885 1.10924,-1.1633 1.66385,-1.74493 0.35992,-0.66386 0.81398,-1.28477 1.07976,-1.99162 0.76682,-2.03946 0.52979,-4.22407 -0.42933,-6.15061 -0.8313,-1.66965 -1.41842,-2.03839 -2.72302,-3.335 -0.59875,-0.39686 -1.16573,-0.84644 -1.79625,-1.19059 -0.71255,-0.38891 -1.45526,-0.72897 -2.21993,-1.00156 -1.42696,-0.50864 -3.47077,-0.77206 -4.98648,-0.54576 -0.38701,0.0577 -0.7555,0.20404 -1.13323,0.3061 -0.93673,0.64511 -0.56153,0.28106 -1.17327,1.04058 -0.0122,0.0132 0.17272,0.18501 0.18487,0.17192 v 0 c 0.64935,-0.47631 0.25662,-0.29686 1.22623,-0.41773 0.89755,-0.0142 1.50161,-0.0498 2.41827,0.0588 1.54349,0.183 3.27547,0.65143 4.65372,1.38276 0.5725,0.30377 1.10125,0.68372 1.65187,1.02562 0.48548,0.43905 1.02003,0.82932 1.45644,1.31716 0.75533,0.84439 1.51579,2.09881 1.80699,3.20829 0.3055,1.16382 0.22751,2.34569 -0.20352,3.46819 -0.23217,0.60459 -0.63053,1.13146 -0.94579,1.69715 -0.48343,0.50254 -0.90335,1.07514 -1.45036,1.50763 -2.43564,1.92578 -5.85675,2.47477 -8.84235,1.84862 -0.61507,-0.12897 -1.19,-0.40464 -1.785,-0.60695 -1.52635,-1.07367 -2.17354,-1.26066 -3.0805,-2.98486 -1.12087,-2.13086 -1.04514,-4.65928 -0.48104,-6.92834 0.18595,-0.74797 0.50357,-1.4569 0.75536,-2.18534 0.33415,-0.60101 0.60511,-1.24185 1.00249,-1.80307 0.77852,-1.09961 1.90373,-2.02668 3.27218,-2.2118 0.064,-0.009 0.79689,0.0326 1.01662,0.0447 0.0208,0.0267 0.39847,-0.26672 0.37774,-0.29342 z" /><path
             id="path6218"
             style="opacity:1;stroke-width:11.0069;paint-order:markers fill stroke"
             d="m 844.56445,307.45703 c -0.36069,0.049 -0.73929,0.0696 -1.12109,0.1543 -1.2486,0.27699 -2.4428,0.91853 -3.27539,1.91015 -0.68577,-0.46955 -1.46046,-0.86458 -2.25977,-0.94726 -0.30132,-0.0311 -0.58409,0.0172 -0.84375,0.0254 a 0.1628062,0.1628062 0 0 0 -0.0469,0.008 c -0.26459,0.0888 -0.56121,0.15175 -0.84766,0.28711 -1.14068,0.53907 -2.23052,1.63401 -2.74805,2.78711 -0.11306,0.25186 -0.15883,0.50653 -0.22851,0.73242 a 0.1628062,0.1628062 0 0 0 -0.006,0.0469 c -0.01,0.74912 -0.0531,0.45671 0.11719,1.09961 l -0.004,-0.0371 c 10e-6,1.9e-4 0.0155,0.0682 0.0156,0.0684 9e-5,1.8e-4 0.0291,0.0408 0.0293,0.041 3.5e-4,3.6e-4 0.0462,0.0348 0.0469,0.0352 6.6e-4,3.2e-4 0.0205,0.008 0.0273,0.01 0.007,0.002 0.0108,0.003 0.0156,0.004 0.0193,0.004 0.0324,0.005 0.0449,0.006 0.0251,0.002 0.0502,0.003 0.0762,0.002 0.0259,-6e-4 0.0495,-10e-4 0.0742,-0.004 0.0123,-10e-4 0.0244,-0.003 0.043,-0.008 0.009,-0.002 0.019,-0.004 0.041,-0.0156 0.005,-0.003 0.0193,-0.0135 0.0195,-0.0137 2.5e-4,-1.8e-4 0.0252,-0.0213 0.0254,-0.0215 1.6e-4,-1.8e-4 0.0292,-0.0447 0.0293,-0.0449 8e-5,-1.7e-4 0.0118,-0.0548 0.0137,-0.0644 v -0.006 c 0.002,-0.26169 -0.003,-0.32933 0.004,-0.35742 0.007,-0.0272 0.0577,-0.12467 0.16211,-0.37696 0.63012,-0.96154 1.72956,-2.2909 2.70898,-2.80664 0.15791,-0.0831 0.35712,-0.13108 0.56446,-0.20312 0.21023,-0.005 0.40364,-0.0286 0.57031,-0.006 0.93883,0.13092 1.74987,0.77387 2.69531,1.14453 1.7e-4,9e-5 0.008,0.004 0.0137,0.006 0.0144,0.005 0.0365,0.0136 0.0371,0.0137 8.1e-4,1.6e-4 0.0252,0.002 0.0352,0.002 0.01,-1.1e-4 0.0182,-8.9e-4 0.0254,-0.002 0.0286,-0.004 0.0442,-0.01 0.0586,-0.0156 0.0289,-0.012 0.0528,-0.0267 0.0801,-0.043 0.0545,-0.0326 0.11581,-0.0756 0.17774,-0.1211 0.0619,-0.0455 0.12255,-0.0926 0.16992,-0.13476 0.0237,-0.0211 0.0444,-0.0386 0.0645,-0.0625 0.01,-0.012 0.0206,-0.0247 0.0332,-0.0508 0.003,-0.007 0.005,-0.0139 0.008,-0.0234 0.003,-0.01 0.008,-0.0343 0.008,-0.0352 9e-5,-8.1e-4 -0.002,-0.054 -0.002,-0.0547 -1.5e-4,-6.7e-4 -0.0289,-0.0639 -0.0293,-0.0645 a 0.1628062,0.1628062 0 0 0 -0.0215,-0.0234 c -0.0881,-0.0788 -0.18633,-0.15858 -0.28125,-0.23828 0.89211,-0.63741 1.87735,-1.1166 2.96289,-1.27929 0.31046,-0.0465 0.63869,-0.0475 0.97461,-0.0723 0.52497,0.0477 1.14515,0.10743 1.68554,0.28516 0.54421,0.17898 0.99626,0.4665 1.23242,0.97265 0.0185,0.0397 0.0228,0.12293 0.043,0.23243 10e-4,0.17482 10e-4,0.26955 -0.01,0.30078 -0.0111,0.032 -0.0471,0.0754 -0.18164,0.18164 -1.1e-4,8e-5 -0.0448,0.0468 -0.0449,0.0469 -7e-5,1.3e-4 -0.0195,0.0448 -0.0195,0.0449 -8e-5,3.4e-4 -0.004,0.0542 -0.004,0.0547 3e-5,5e-4 0.002,0.0207 0.004,0.0274 0.002,0.007 0.002,0.0113 0.004,0.0156 0.006,0.0173 0.0112,0.0263 0.0156,0.0352 0.009,0.0176 0.0175,0.0331 0.0273,0.0488 0.01,0.0157 0.0193,0.0294 0.0312,0.0449 0.006,0.008 0.0104,0.0147 0.0234,0.0273 0.003,0.003 0.008,0.007 0.0137,0.0117 0.005,0.004 0.023,0.0154 0.0234,0.0156 4.2e-4,2.4e-4 0.0524,0.0195 0.0527,0.0195 1.6e-4,2e-5 0.0526,0.002 0.0527,0.002 1.4e-4,-2e-5 0.0643,-0.0253 0.0645,-0.0254 l -0.0352,0.0176 c 0.23322,-0.0803 0.4242,-0.1344 0.5957,-0.25196 0.17151,-0.11756 0.30291,-0.29716 0.40821,-0.57422 a 0.1628062,0.1628062 0 0 0 0.01,-0.0684 c -0.009,-0.15703 0.0261,-0.35635 -0.0332,-0.57617 -0.17346,-0.64166 -0.65952,-1.12402 -1.23047,-1.46484 -0.57095,-0.34082 -1.23133,-0.54626 -1.79492,-0.62695 -0.40002,-0.0572 -0.7934,-0.0315 -1.16406,-0.0469 a 0.1628062,0.1628062 0 0 0 -0.0274,0 z" /><path
             style="opacity:1;fill:#000000;fill-opacity:1;stroke-width:11.0069;-inkscape-stroke:none;paint-order:markers fill stroke"
             id="path6219"
             d="m 848.46826,311.15315 c 1.66861,-0.1214 3.40875,-0.49486 5.05045,0.0401 0.35616,0.11609 0.67507,0.32485 1.01263,0.48729 0.18421,0.17143 0.39082,0.32162 0.55271,0.5143 0.73702,0.87721 1.11503,1.85265 0.78668,2.9681 -0.21474,0.21373 -0.0859,0.17414 -0.38979,0.10751 -0.008,0 -0.0184,0.11837 -0.01,0.11906 v 0 c 0.45399,0.14654 0.20463,0.11032 0.753,0.0661 0.14713,-0.11237 0.33373,-0.18647 0.44138,-0.3371 0.70171,-0.9818 0.0377,-2.79604 -0.67292,-3.5764 -0.35252,-0.38711 -0.813,-0.66001 -1.21949,-0.98999 -0.4186,-0.17994 -0.81779,-0.4143 -1.25584,-0.53979 -1.75215,-0.50198 -3.61414,-0.0931 -5.26889,0.54173 -0.0424,0.0156 0.17758,0.61459 0.21991,0.59907 z" /><path
             id="path6220"
             style="opacity:1;stroke-width:11.0069;paint-order:markers fill stroke"
             d="m 856.94727,313.90625 c -7.1e-4,-1.4e-4 -0.10864,0.002 -0.10938,0.002 -7.4e-4,1.7e-4 -0.0603,0.0193 -0.0801,0.0312 -0.0396,0.024 -0.0566,0.0455 -0.0703,0.0625 -0.0274,0.034 -0.0362,0.0553 -0.0449,0.0742 -0.0173,0.0378 -0.0266,0.0679 -0.0371,0.10352 -0.0209,0.0713 -0.0401,0.15491 -0.0566,0.24023 -0.0165,0.0853 -0.0299,0.17023 -0.0371,0.24414 -0.004,0.037 -0.006,0.0698 -0.004,0.11133 9.7e-4,0.0208 10e-4,0.0424 0.0137,0.084 0.006,0.0208 0.0136,0.0471 0.041,0.084 0.0137,0.0185 0.0599,0.0582 0.0606,0.0586 3.8e-4,2.7e-4 0.0333,0.013 0.0625,0.0254 l -0.0274,-0.006 c 1.17841,0.59952 2.26935,1.35433 2.97657,2.44922 0.19163,0.29665 0.33745,0.64811 0.51953,1.00391 0.12162,0.37718 0.26481,0.72818 0.33789,1.07031 0.23243,1.08824 0.16118,2.39127 -0.52149,3.25 -0.0772,0.0971 -0.21103,0.19666 -0.35156,0.32422 -0.006,0.003 -0.01,0.005 -0.0156,0.008 -0.0617,-0.0479 -0.1327,-0.11226 -0.17579,-0.14843 l 0.0352,0.0351 c -4.1e-4,-5e-4 -0.0853,-0.068 -0.0859,-0.0684 -6.1e-4,-3.1e-4 -0.0793,-0.0253 -0.0801,-0.0254 -8.1e-4,-1.2e-4 -0.0394,-0.005 -0.0547,-0.004 -0.0153,8.3e-4 -0.0285,0.004 -0.0391,0.006 -0.0421,0.008 -0.0601,0.0169 -0.0781,0.0254 -0.0361,0.0169 -0.0632,0.0339 -0.0918,0.0527 -0.0572,0.0377 -0.11784,0.0851 -0.17968,0.13477 -0.0619,0.0497 -0.1227,0.10067 -0.17188,0.14843 -0.0246,0.0239 -0.046,0.0446 -0.0703,0.0762 -0.0122,0.0158 -0.0259,0.0329 -0.043,0.0723 -0.004,0.01 -0.008,0.0205 -0.0117,0.0352 -0.004,0.0147 -0.01,0.0558 -0.01,0.0566 -5e-5,8.2e-4 0.008,0.0814 0.008,0.082 1.7e-4,6.6e-4 0.0484,0.0971 0.0488,0.0976 l -0.008,-0.01 c 0.60814,0.85197 0.80001,2.12757 0.73828,3.20312 a 0.25727496,0.25727496 0 0 0 -0.002,0.002 c -0.0162,0.28402 -0.0815,0.58279 -0.12891,0.90429 -0.11691,0.30501 -0.19555,0.59874 -0.32226,0.83594 -0.53188,0.99545 -1.47145,1.76653 -2.47461,2.31836 -0.031,-0.002 -0.0618,-0.004 -0.0937,-0.006 a 0.25727496,0.25727496 0 0 0 -0.0137,0 c -1.3e-4,0 -0.0917,0.0175 -0.0918,0.0176 -1.3e-4,5e-5 -0.0604,0.0331 -0.0606,0.0332 -2.7e-4,2e-4 -0.0544,0.0524 -0.0547,0.0527 -5.8e-4,7.6e-4 -0.026,0.043 -0.0312,0.0547 -0.0104,0.0233 -0.0124,0.0335 -0.0156,0.0449 -0.007,0.0228 -0.0121,0.0413 -0.0156,0.0605 -0.004,0.0193 -0.006,0.0369 -0.008,0.0606 -10e-4,0.0118 -0.002,0.0238 0,0.0508 4.3e-4,0.007 3.2e-4,0.0149 0.002,0.0254 0.002,0.0105 0.01,0.0406 0.01,0.041 1.4e-4,4.2e-4 0.0428,0.0798 0.043,0.0801 9e-5,1.1e-4 0.0496,0.0463 0.0566,0.0527 5e-4,4.6e-4 0.004,0.004 0.004,0.004 0,0 0.004,0.002 0.004,0.002 0.0912,0.0633 0.18245,0.12698 0.2754,0.19141 a 0.25727496,0.25727496 0 0 0 0.11523,0.0449 c 0.0683,0.008 0.19504,0.0138 0.29102,0.0312 -0.27602,0.57959 -0.57994,1.12451 -0.99805,1.55469 -0.17777,0.18292 -0.39133,0.34804 -0.60742,0.53906 -0.82876,0.58645 -1.73801,1.01751 -2.67774,1.33984 -0.72316,0.24804 -1.48725,0.39838 -2.25586,0.60547 -0.0318,0.003 -0.0548,0.008 -0.0801,0.0117 -10e-4,-0.002 -0.006,-0.01 -0.006,-0.01 -9e-5,-9e-5 -0.0526,-0.0448 -0.0527,-0.0449 -2.3e-4,-1.5e-4 -0.0836,-0.0351 -0.084,-0.0351 -3.7e-4,-9e-5 -0.0348,-0.005 -0.0469,-0.006 -0.0121,-5e-4 -0.0215,-5.1e-4 -0.0293,0 -0.031,0.002 -0.0426,0.007 -0.0547,0.01 -0.0241,0.006 -0.04,0.0112 -0.0566,0.0176 -0.0167,0.006 -0.0321,0.0128 -0.0527,0.0234 -0.0103,0.005 -0.0206,0.009 -0.043,0.0254 -0.006,0.004 -0.0115,0.0104 -0.0195,0.0176 -0.008,0.007 -0.0291,0.031 -0.0293,0.0312 -2.4e-4,2.9e-4 -0.0409,0.072 -0.041,0.0723 -5e-5,1.3e-4 -0.0156,0.0683 -0.0156,0.0684 0,1.2e-4 0.008,0.0897 0.008,0.0898 a 0.25727496,0.25727496 0 0 0 0.008,0.0254 c 0.0426,0.1096 0.0652,0.17575 0.0879,0.23437 0.0227,0.0586 0.0569,0.12895 0.11328,0.18555 0.11268,0.11319 0.16542,0.10918 0.38477,0.26953 a 0.25727496,0.25727496 0 0 0 0.0957,0.043 c 0.19078,0.0432 0.41771,0.1405 0.69727,0.15625 1.44657,0.0813 2.99624,-0.61348 4.17968,-1.38672 0.312,-0.20388 0.5859,-0.44076 0.85743,-0.64649 a 0.25727496,0.25727496 0 0 0 0.0234,-0.0215 c 0.21953,-0.21415 0.46915,-0.4218 0.69922,-0.68359 0.67472,-0.76774 1.1476,-1.75211 1.36328,-2.80664 0.92396,-0.4939 1.63769,-1.38643 2.06641,-2.23047 0.18936,-0.37278 0.28666,-0.75695 0.41406,-1.09571 a 0.25727496,0.25727496 0 0 0 0.0156,-0.0566 c 0.0471,-0.35434 0.13606,-0.72928 0.15039,-1.13672 0.0321,-0.91443 -0.14351,-1.99821 -0.58594,-2.90429 a 0.25727496,0.25727496 0 0 0 0.0176,-0.004 c 0.20771,-0.1091 0.49955,-0.19121 0.76172,-0.4082 1.28106,-1.06038 1.36644,-2.97505 1.08984,-4.39453 -0.0917,-0.47055 -0.26562,-0.89536 -0.38867,-1.30664 a 0.25727496,0.25727496 0 0 0 -0.0195,-0.0469 c -0.20623,-0.38706 -0.38377,-0.82103 -0.65625,-1.22851 -0.94783,-1.41734 -2.45854,-2.39657 -4.10352,-2.75977 a 0.25727496,0.25727496 0 0 0 -0.004,0 z" /><path
             id="path6221"
             style="opacity:1;stroke-width:11.0069;paint-order:markers fill stroke"
             d="m 834.16211,313.50977 c -5.8e-4,-8e-5 -0.11398,0.009 -0.125,0.01 -0.002,2.8e-4 -0.004,-2.8e-4 -0.006,0 -1.40985,0.20848 -2.73708,0.95668 -3.68359,2.00977 -0.27152,0.30211 -0.46367,0.62859 -0.66797,0.90625 a 0.30993378,0.30993378 0 0 0 -0.0332,0.0586 c -0.12479,0.28445 -0.31197,0.58893 -0.42187,0.96484 -0.31452,1.07584 -0.19905,2.42902 0.69726,3.27539 0.13592,0.12829 0.2548,0.18112 0.36133,0.24024 -0.62357,1.04149 -1.0567,2.23356 -1.21289,3.41016 -0.0525,0.39474 -0.0409,0.77264 -0.0586,1.12109 a 0.30993378,0.30993378 0 0 0 0.004,0.0664 c 0.0489,0.2898 0.0568,0.63303 0.17188,0.99414 0.25311,0.79414 0.89749,1.49734 1.82812,1.51757 0.154,0.003 0.28365,-0.0375 0.40625,-0.084 0.10905,1.0981 0.44318,2.16788 1.05274,3.09375 0.20622,0.31329 0.44691,0.57264 0.64648,0.82812 a 0.30993378,0.30993378 0 0 0 0.0352,0.0391 c 0.21314,0.19322 0.42832,0.42955 0.70703,0.63672 0.21508,0.15986 0.56515,0.38128 0.94922,0.50586 0.19203,0.0623 0.3949,0.10347 0.60742,0.0762 0.0355,-0.005 0.0697,-0.0274 0.10547,-0.0371 0.1218,0.84725 0.44783,1.65593 1.11133,2.26367 0.27445,0.25135 0.57372,0.41049 0.81445,0.58203 a 0.30993378,0.30993378 0 0 0 0.0391,0.0234 c 1.36479,0.69685 2.97858,0.97015 4.44727,0.25586 0.19793,-0.0963 0.3443,-0.21625 0.47266,-0.29688 a 0.30993378,0.30993378 0 0 0 0.0957,-0.0937 c 0.12001,-0.18612 0.18158,-0.17963 0.24023,-0.38476 0.0293,-0.10257 0.0119,-0.19149 0,-0.24805 -0.0119,-0.0566 -0.0272,-0.11207 -0.0449,-0.21094 l 0.006,0.0547 c 0,-9e-5 -0.0195,-0.10732 -0.0195,-0.10742 -4e-5,-10e-5 -0.037,-0.0702 -0.0371,-0.0703 -1.4e-4,-2.1e-4 -0.0603,-0.0642 -0.0606,-0.0645 -5.4e-4,-4.4e-4 -0.0491,-0.0346 -0.0625,-0.041 -0.0268,-0.0128 -0.0393,-0.014 -0.0508,-0.0176 -0.023,-0.007 -0.0396,-0.0121 -0.0566,-0.0156 -0.0171,-0.003 -0.0325,-0.005 -0.0566,-0.008 -0.0121,-10e-4 -0.0232,-0.004 -0.0547,-0.002 -0.008,3.9e-4 -0.0168,1.8e-4 -0.0293,0.002 -0.0125,0.002 -0.0505,0.0116 -0.0508,0.0117 -1.6e-4,5e-5 -0.0236,0.0115 -0.0469,0.0234 l 0.006,-0.006 c -0.11065,0.0528 -0.11504,0.0548 -0.12695,0.0586 -0.0119,0.004 -0.0779,0.0212 -0.2461,0.0742 a 0.30993378,0.30993378 0 0 0 -0.0234,0.008 c -1.29481,0.52428 -2.1767,0.53318 -3.46485,-0.0234 -0.62144,-0.37459 -0.71096,-0.35166 -1.1582,-0.89454 -0.40192,-0.48786 -0.52505,-1.10188 -0.67578,-1.79492 l 0.006,0.0937 c 6e-5,-7e-4 -0.0348,-0.17508 -0.0352,-0.17578 -1.9e-4,-3.5e-4 -0.0368,-0.0543 -0.0371,-0.0547 -2.9e-4,-3.4e-4 -0.0246,-0.0259 -0.0352,-0.0351 -0.0423,-0.037 -0.0675,-0.0459 -0.0879,-0.0547 -0.0409,-0.0175 -0.0621,-0.0207 -0.084,-0.0254 -0.0438,-0.009 -0.0839,-0.0152 -0.12695,-0.0195 -0.007,-7e-4 -0.0144,6.4e-4 -0.0215,0 -7.7e-4,-0.001 -0.004,-0.008 -0.004,-0.008 -1.9e-4,-2.2e-4 -0.0817,-0.0643 -0.082,-0.0645 -3.5e-4,-2e-4 -0.0335,-0.0172 -0.0449,-0.0215 -0.0114,-0.004 -0.0199,-0.008 -0.0273,-0.01 -0.0297,-0.008 -0.0421,-0.0101 -0.0547,-0.0117 -0.0251,-0.003 -0.0432,-0.003 -0.0625,-0.004 -0.0193,-7.3e-4 -0.038,-10e-4 -0.0625,0 -0.0122,6.5e-4 -0.0238,3.2e-4 -0.0527,0.006 -0.007,10e-4 -0.0141,0.003 -0.0254,0.006 -0.0113,0.003 -0.0465,0.0174 -0.0469,0.0176 -3.6e-4,1.7e-4 -0.0857,0.0584 -0.0859,0.0586 -6e-5,6e-5 -0.0232,0.0293 -0.041,0.0527 -0.4004,-0.22783 -0.76642,-0.52132 -1.09375,-0.87304 -10e-4,-0.001 -0.003,-0.003 -0.004,-0.004 -0.19269,-0.24029 -0.38589,-0.45466 -0.53906,-0.67578 -0.70783,-1.02184 -1.08459,-2.20963 -1.25391,-3.45703 l 0.002,0.0625 c 4e-5,-6.9e-4 -0.0173,-0.13018 -0.0176,-0.13086 -2.5e-4,-6.9e-4 -0.0318,-0.0664 -0.0488,-0.0879 -0.034,-0.043 -0.0623,-0.0607 -0.084,-0.0742 -0.0434,-0.027 -0.0681,-0.0341 -0.0899,-0.041 -0.0435,-0.0138 -0.0766,-0.0193 -0.11328,-0.0254 -0.0734,-0.0121 -0.15578,-0.0195 -0.24023,-0.0254 -0.0845,-0.006 -0.16781,-0.01 -0.24219,-0.008 -0.0372,9.2e-4 -0.0702,0.002 -0.11524,0.01 -0.0225,0.004 -0.047,0.007 -0.0937,0.0274 -0.0234,0.0104 -0.054,0.0245 -0.0937,0.0625 -0.0198,0.019 -0.0602,0.0794 -0.0605,0.0801 -3.4e-4,6.3e-4 -0.0341,0.12087 -0.0352,0.125 a 0.30993378,0.30993378 0 0 0 0,0.002 0.30993378,0.30993378 0 0 0 -0.002,0 c -4.8e-4,0.007 -10e-4,0.0143 -0.002,0.0215 -0.0573,0.008 -0.11009,0.0198 -0.16407,0.0234 -0.13306,0.009 -0.24983,-0.0269 -0.21289,-0.006 -0.21681,-0.12353 -0.32323,-0.29112 -0.39648,-0.52929 -0.0719,-0.23375 -0.094,-0.52693 -0.11524,-0.82227 0.024,-0.32906 0.0292,-0.6405 0.0723,-0.92578 0.21263,-1.40281 0.73841,-2.79313 1.39062,-4.07031 l -0.0332,0.0527 c 3.7e-4,-4.6e-4 0.0584,-0.11659 0.0586,-0.11719 1.6e-4,-6e-4 0.01,-0.0989 0.01,-0.0996 -5e-5,-7.4e-4 -0.007,-0.049 -0.0117,-0.0664 -0.005,-0.0174 -0.0106,-0.0315 -0.0156,-0.043 -0.02,-0.0461 -0.0357,-0.0631 -0.0488,-0.0801 -0.0263,-0.034 -0.0467,-0.0552 -0.0703,-0.0781 -0.0473,-0.0458 -0.10099,-0.0928 -0.15821,-0.13868 -0.0572,-0.0458 -0.11491,-0.0889 -0.16992,-0.125 -0.0275,-0.0181 -0.0528,-0.0326 -0.0918,-0.0508 -0.0195,-0.009 -0.0405,-0.0218 -0.0898,-0.0312 -0.0123,-0.002 -0.0268,-0.003 -0.0449,-0.004 -0.0181,-9.6e-4 -0.0657,0.002 -0.0664,0.002 -7.3e-4,1.1e-4 -0.0951,0.031 -0.0957,0.0312 -5.5e-4,2.8e-4 -0.1012,0.0835 -0.10156,0.084 -0.0128,0.0144 -0.0296,0.0341 -0.043,0.0488 -0.42315,-0.62363 -0.63121,-1.21114 -0.3711,-2.00976 0.0691,-0.21234 0.20985,-0.44168 0.33985,-0.70899 0.19191,-0.26092 0.35329,-0.51733 0.53515,-0.7207 0.77893,-0.87107 1.82696,-1.53308 2.92383,-1.9668 l -0.0234,0.008 c 5.6e-4,-1.6e-4 0.11477,-0.064 0.11524,-0.0645 4.7e-4,-4e-4 0.0641,-0.0755 0.0644,-0.0762 3.8e-4,-6.3e-4 0.0215,-0.0435 0.0274,-0.0605 0.006,-0.0171 0.009,-0.0306 0.0117,-0.043 0.01,-0.0493 0.007,-0.0723 0.006,-0.0937 -0.002,-0.0429 -0.007,-0.0714 -0.0137,-0.10351 -0.0128,-0.0642 -0.0318,-0.13338 -0.0527,-0.20313 -0.0209,-0.0697 -0.0437,-0.13855 -0.0684,-0.19922 -0.0123,-0.0303 -0.0232,-0.0567 -0.0449,-0.0937 -0.0109,-0.0185 -0.0214,-0.0384 -0.0566,-0.0742 -0.009,-0.009 -0.0189,-0.0202 -0.0332,-0.0312 -0.0143,-0.011 -0.056,-0.0348 -0.0566,-0.0352 -6.6e-4,-3.2e-4 -0.0951,-0.0273 -0.0957,-0.0273 z" /><path
             style="opacity:1;fill:#000000;fill-opacity:1;stroke-width:11.0716;-inkscape-stroke:none;paint-order:markers fill stroke"
             id="path6222"
             d="m 841.55707,334.88422 c 0.81185,1.49301 2.07502,2.55433 3.44204,3.05227 0.46774,0.17034 0.95333,0.24763 1.42997,0.37146 0.39578,-0.0147 0.79605,0.0332 1.18731,-0.044 1.14622,-0.22665 2.64668,-1.22587 2.91879,-2.81724 0.0417,-0.24392 -0.0133,-0.49905 -0.0201,-0.7486 -0.0688,-0.16198 -0.13749,-0.32397 -0.20623,-0.4859 -0.003,-0.0131 -0.14721,0.03 -0.14483,0.043 v 0 c 0.004,0.12112 0.007,0.24218 0.0114,0.3633 -0.062,0.15385 -0.10913,0.31895 -0.18586,0.46156 -0.59284,1.10172 -1.553,1.81573 -2.5931,1.96891 -0.34269,0.0504 -0.68992,-0.003 -1.03485,-0.003 -0.27737,-0.046 -0.56018,-0.0546 -0.83211,-0.13819 -1.30934,-0.40243 -2.50908,-1.27534 -3.55061,-2.34254 -0.0176,-0.0378 -0.43941,0.2814 -0.42173,0.31943 z" /><path
             style="opacity:1;fill:#ffed4d;fill-opacity:1;stroke-width:11.2069;-inkscape-stroke:none;paint-order:markers fill stroke"
             d="m 4342.3627,3037.433 c -3.9046,0.2085 -7.9999,1.4726 -10.9457,4.0756 -0.7594,0.8214 0.9106,1.8554 -0.4744,2.1199 -3.522,-1.007 -6.953,-4.3367 -10.8034,-2.8726 -3.9313,1.7847 -6.8557,5.3253 -9.0667,8.9389 -0.901,1.2242 -0.3878,3.2311 1.2595,3.258 1.322,1.6379 -1.3025,2.0001 -2.2263,2.6668 -4.0989,2.363 -8.3831,5.9315 -9.1254,10.869 -0.077,1.953 0.7106,4.6365 3.028,4.6846 1.8529,0.4571 0.3946,2.2219 0.058,3.3607 -1.8787,4.6959 -3.9581,9.9433 -2.7378,15.0545 0.4291,1.5569 2.4189,2.8036 3.6598,1.3078 1.155,-0.4921 2.2893,-0.012 2.2394,1.3079 0.9846,5.2512 3.6777,10.5318 8.3499,13.3598 0.9824,0.2436 2.4413,-0.2791 2.7539,1.1366 0.648,3.2582 2.6057,6.2629 5.7494,7.5855 2.8795,1.4302 6.4977,1.5416 9.4686,0.3874 0.7182,-0.5378 1.1422,-1.336 2.066,-0.6809 0.9426,0.2543 1.049,1.7802 2.0627,2.1821 4.325,3.4738 10.683,6.1671 15.9762,3.2628 2.1647,-1.1581 3.868,-3.0681 4.9925,-5.2308 -0.325,1.3688 0.6924,3.2004 2.2553,2.3928 6.5525,-1.7057 13.904,-4.4341 17.0742,-10.9306 0.8314,-1.3644 -1.944,-1.8201 -1.5206,-2.7172 5.0483,-2.4694 9.4891,-7.5129 9.0631,-13.455 0.3595,-3.1465 -0.9563,-6.0301 -2.0714,-8.8707 0.6995,-0.7893 1.4966,-0.5778 2.3492,-0.4157 2.4811,-1.1553 3.209,-4.415 3.4347,-6.9246 0.195,-6.6556 -3.6506,-13.0741 -9.4266,-16.3176 -1.1882,-1.3608 -2.8813,-1.3414 -4.1424,-0.3588 1.3941,-6.3816 -4.4896,-12.6544 -10.8322,-12.6162 -3.7797,-0.528 -7.6035,0.2278 -11.3505,0.1658 -0.5664,-0.5253 -2.4059,0.4234 -1.4716,-0.743 0.9303,-3.1001 -2.7146,-5.0155 -5.2328,-5.5249 -1.4421,-0.3469 -2.9299,-0.5021 -4.4125,-0.4579 z m -6.4883,14.6076 c 1.7549,-0.011 3.6193,0.5462 4.6542,1.9155 4.733,0.7449 9.6465,0.9419 14.109,2.9148 6.7867,2.812 12.9885,7.6767 16.617,14.1289 4.2092,7.6355 3.365,17.7413 -2.4938,24.3009 -5.8889,7.2467 -15.3711,10.9043 -24.5572,10.6029 -8.3241,0.4198 -16.3422,-3.9559 -21.7891,-10.0232 -5.6266,-7.3642 -6.2898,-17.3781 -3.6236,-25.9845 2.3376,-7.0261 6.3896,-14.5612 13.713,-17.2918 1.0845,-0.3624 2.2248,-0.5741 3.3705,-0.5635 z m 3.9208,0.8714 c -0.027,-0.097 0.029,-0.3428 0,0 z"
             id="path6223"
             transform="matrix(0.34724336,0,0,0.34724336,-663.2572,-746.26907)" /></g><path
           style="opacity:1;fill:#000000;fill-opacity:1;stroke-width:6.65133;-inkscape-stroke:none;paint-order:markers fill stroke"
           id="path6224"
           d="m 798.13903,336.10523 c -0.0235,0.11706 -0.0531,0.23272 -0.0706,0.3512 -0.0935,0.63361 -0.12857,1.13528 -0.16141,1.79515 -0.0258,0.51993 -0.0513,1.04016 -0.0586,1.56133 -0.0164,1.17337 0.0309,2.82251 0.0562,3.97878 0.0694,1.69782 0.0794,2.44507 0.22477,4.11186 0.0796,0.91236 0.16092,1.7525 0.37658,2.63617 0.0405,0.166 0.11437,0.32119 0.17157,0.48178 -0.005,0.0177 0.22981,0.0976 0.23456,0.0798 v 0 c 0.0841,-0.13325 0.20168,-0.24721 0.25219,-0.39971 0.2442,-0.73736 0.2836,-1.77038 0.30819,-2.51213 0.0583,-1.75808 -0.003,-2.30745 -0.082,-4.10995 -0.14897,-1.88581 -0.295,-3.76959 -0.52194,-5.64905 -0.0503,-0.41618 -0.0996,-0.83273 -0.16497,-1.24688 -0.0525,-0.33304 -0.14499,-0.71603 -0.22389,-1.05562 10e-4,-0.0261 -0.33983,-0.0487 -0.34066,-0.0227 z" /><path
           style="opacity:1;fill:#000000;fill-opacity:1;stroke-width:5.68228;-inkscape-stroke:none;paint-order:markers fill stroke"
           id="path6225"
           d="m 803.998,343.34185 c -0.0776,0.0533 -0.16325,0.10522 -0.23289,0.16002 -0.37226,0.29307 -0.61193,0.53013 -0.90838,0.84367 l -3.34252,4.67685 c -0.23313,0.44964 -0.43644,0.86473 -0.46631,1.3181 -0.006,0.0852 0.04,0.16944 0.06,0.25416 -0.0132,0.008 0.28798,0.0766 0.30143,0.0687 v 0 c 0.16942,-0.0533 0.37884,-0.093 0.50804,-0.15995 l 4.23111,-5.94763 c 0.0865,-0.20691 0.17467,-0.41387 0.23916,-0.62175 0.052,-0.16716 0.0663,-0.36353 0.0834,-0.53725 0.0117,-0.0125 -0.46206,-0.0673 -0.47308,-0.0549 z"
           sodipodi:nodetypes="ssccccssccscss" /><path
           style="opacity:1;fill:#000000;fill-opacity:1;stroke-width:5.68228;-inkscape-stroke:none;paint-order:markers fill stroke"
           id="path6226"
           d="m 804.30861,343.58739 c 0.0776,0.0533 0.16325,0.10522 0.23289,0.16002 0.37226,0.29307 0.61193,0.53013 0.90838,0.84367 l 3.34252,4.67685 c 0.23313,0.44964 0.43644,0.86473 0.46631,1.3181 0.006,0.0852 -0.04,0.16944 -0.06,0.25416 0.0132,0.008 -0.28798,0.0766 -0.30143,0.0687 v 0 c -0.16942,-0.0533 -0.37884,-0.093 -0.50804,-0.15995 l -4.23111,-5.94763 c -0.0865,-0.20691 -0.17467,-0.41387 -0.23916,-0.62175 -0.052,-0.16716 -0.0663,-0.36353 -0.0834,-0.53725 -0.0117,-0.0125 0.46206,-0.0673 0.47308,-0.0549 z"
           sodipodi:nodetypes="ssccccssccscss" /><path
           style="opacity:1;fill:#000000;fill-opacity:1;stroke-width:6.65133;-inkscape-stroke:none;paint-order:markers fill stroke"
           id="path6227"
           d="m 809.55343,336.08769 c -0.0311,0.1153 -0.0682,0.22879 -0.0933,0.34588 -0.13449,0.62619 -0.20209,1.12453 -0.27774,1.78086 -0.0595,0.51716 -0.1188,1.03464 -0.15997,1.55422 -0.0927,1.16982 -0.15263,2.81855 -0.20202,3.97405 -0.041,1.69873 -0.0798,2.44504 -0.043,4.11777 0.0201,0.9156 0.0467,1.75926 0.20446,2.65507 0.0297,0.16829 0.0933,0.32795 0.13989,0.49192 -0.005,0.0173 0.22299,0.11233 0.22888,0.0948 v 0 c 0.0926,-0.1275 0.21732,-0.23358 0.27765,-0.38246 0.2916,-0.71994 0.39804,-1.74821 0.4708,-2.48679 0.17246,-1.75058 0.14695,-2.30277 0.18521,-4.1066 -0.0262,-1.89151 -0.0494,-3.78079 -0.1537,-5.67102 -0.0231,-0.41857 -0.0453,-0.83745 -0.0836,-1.25497 -0.0308,-0.33575 -0.0981,-0.72394 -0.15481,-1.06794 10e-4,-0.0261 -0.33594,-0.0707 -0.33846,-0.0447 z" /></g><rect
         style="fill:none;stroke-width:1.52;stroke-linecap:round;stroke-linejoin:round;paint-order:markers stroke fill"
         id="rect21"
         width="71.172882"
         height="69.320854"
         x="1139.0667"
         y="646.35834" /></g></g></svg>
