<?xml version="1.0" encoding="utf-8"?>
<!-- Generator: Adobe Illustrator 26.2.1, SVG Export Plug-In . SVG Version: 6.00 Build 0)  -->
<svg version="1.1" id="Layer_1" xmlns="http://www.w3.org/2000/svg" xmlns:xlink="http://www.w3.org/1999/xlink" x="0px" y="0px"
	 viewBox="0 0 512 512" style="enable-background:new 0 0 512 512;" xml:space="preserve">
<path d="M272.1,349.7l92.6-169.8c6.7-12.2-2.2-27.1-16.1-27.1H163.4c-13.9,0-22.8,14.9-16.1,27.1l92.6,169.8
	C246.8,362.5,265.1,362.5,272.1,349.7z"/>
</svg>
