<?xml version="1.0" encoding="UTF-8"?>
<svg width="1280px" height="1163px" viewBox="0 0 1280 1163" version="1.1" xmlns="http://www.w3.org/2000/svg" xmlns:xlink="http://www.w3.org/1999/xlink">
    <title>16-password-reset</title>
    <defs>
        <rect id="path-1" x="253" y="133" width="774" height="508" rx="6"></rect>
        <filter x="-1.0%" y="-1.5%" width="101.9%" height="103.0%" filterUnits="objectBoundingBox" id="filter-2">
            <feOffset dx="0" dy="0" in="SourceAlpha" result="shadowOffsetOuter1"></feOffset>
            <feGaussianBlur stdDeviation="2.5" in="shadowOffsetOuter1" result="shadowBlurOuter1"></feGaussianBlur>
            <feColorMatrix values="0 0 0 0 0.00784313725   0 0 0 0 0.0470588235   0 0 0 0 0.105882353  0 0 0 0.8 0" type="matrix" in="shadowBlurOuter1"></feColorMatrix>
        </filter>
    </defs>
    <g id="16-password-reset" stroke="none" stroke-width="1" fill="none" fill-rule="evenodd">
        <rect fill="#0A192F" x="0" y="0" width="1280" height="1163"></rect>
        <g id="Rectangle-Copy-24">
            <use fill="black" fill-opacity="1" filter="url(#filter-2)" xlink:href="#path-1"></use>
            <use fill="#233554" fill-rule="evenodd" xlink:href="#path-1"></use>
        </g>
        <text id="Reset-your-password" font-family=".AppleSystemUIFont" font-size="30" font-weight="normal" fill="#CCD6F6">
            <tspan x="505.769043" y="241">Reset your password</tspan>
        </text>
        <text id="Enter-your-email-add" font-family=".AppleSystemUIFont" font-size="17" font-weight="normal" fill="#A8B2D1">
            <tspan x="395.94873" y="287">Enter your email address below and we’ll send you a link to reset </tspan>
            <tspan x="582.0979" y="307">your password.</tspan>
        </text>
        <g id="Group">
            <rect id="Rectangle-Copy-6" fill="#233554" x="0" y="0" width="1280" height="58"></rect>
            <text id="Login-Sign-up" font-family=".AppleSystemUIFont" font-size="14" font-weight="normal">
                <tspan x="1141.7373" y="31" fill="#FFFFFF">Login</tspan>
                <tspan x="1177.02441" y="31" fill="#8892B0">        Sign up</tspan>
            </text>
            <g opacity="0.257068452" transform="translate(24.000000, 11.500000)" stroke="#FFFFFF">
                <rect id="Rectangle" x="0" y="0" width="123" height="35"></rect>
                <line x1="1.5" y1="2" x2="121.5" y2="34" id="Line-3" stroke-linecap="square"></line>
                <line x1="1.5" y1="2" x2="121.5" y2="34" id="Line-3" stroke-linecap="square" transform="translate(61.500000, 18.000000) scale(-1, 1) translate(-61.500000, -18.000000) "></line>
            </g>
        </g>
        <g id="Group" transform="translate(532.000000, 490.000000)" opacity="0.25">
            <g id="button---bright-outline">
                <rect id="Rectangle-Copy-2" stroke="#50CCAE" fill="#50CCAE" x="0.5" y="0.5" width="215" height="55" rx="3"></rect>
                <text id="Sign-up-with-email" font-family=".AppleSystemUIFont" font-size="17" font-weight="normal" fill="#020C1B">
                    <tspan x="41.1953125" y="30">Send link to email</tspan>
                </text>
            </g>
        </g>
        <text id="Take-me-to-the-login" font-family=".AppleSystemUIFont" font-size="14" font-weight="normal">
            <tspan x="557.062988" y="600" fill="#A8B2D1">Take me to the</tspan>
            <tspan x="651.945801" y="600" fill="#64FFDA"> login page</tspan>
        </text>
        <g id="Group" transform="translate(382.000000, 365.000000)">
            <text id="Field-name" font-family=".AppleSystemUIFont" font-size="17" font-weight="normal" fill="#CCD6F6">
                <tspan x="0" y="16">Email</tspan>
            </text>
            <rect id="Rectangle" stroke="#4F5D76" fill="#4F5D76" x="0.845901639" y="34" width="516" height="52" rx="3"></rect>
        </g>
    </g>
</svg>