<?xml version="1.0" encoding="UTF-8"?>
<svg width="1280px" height="836px" viewBox="0 0 1280 836" version="1.1" xmlns="http://www.w3.org/2000/svg" xmlns:xlink="http://www.w3.org/1999/xlink">
    <title>13-email-verified</title>
    <g id="13-email-verified" stroke="none" stroke-width="1" fill="none" fill-rule="evenodd">
        <rect fill="#0A192F" x="0" y="0" width="1280" height="836"></rect>
        <rect id="Rectangle-Copy-15" fill="#BAE67E" x="908" y="74" width="350" height="57" rx="3"></rect>
        <g id="Group" transform="translate(1222.242641, 95.500000)" fill="#020C1B" opacity="0.5">
            <g id="Rectangle">
                <polygon transform="translate(7.000000, 7.000000) rotate(-315.000000) translate(-7.000000, -7.000000) " points="5.83333333 -1.16666667 8.16666667 -1.16666667 8.16666667 15.1666667 5.83333333 15.1666667"></polygon>
                <polygon transform="translate(7.000000, 7.000000) rotate(-225.000000) translate(-7.000000, -7.000000) " points="5.83333333 -1.16666667 8.16666667 -1.16666667 8.16666667 15.1666667 5.83333333 15.1666667"></polygon>
            </g>
        </g>
        <g id="alert---success" transform="translate(926.868895, 88.500000)" fill="#020C1B">
            <path d="M11.7982025,3 C5.72158958,3 0.798202479,7.9233871 0.798202479,14 C0.798202479,20.0766129 5.72158958,25 11.7982025,25 C17.8748154,25 22.7982025,20.0766129 22.7982025,14 C22.7982025,7.9233871 17.8748154,3 11.7982025,3 Z M14.6236057,8.70846774 C14.9607025,8.20282258 15.7191702,8.18951613 16.0740089,8.70846774 C16.6240089,9.52459677 16.743767,10.3451613 16.7703799,11.1612903 C16.7482025,11.9774194 16.6240089,12.7979839 16.0740089,13.6141129 C15.7369122,14.1197581 14.9784444,14.1330645 14.6236057,13.6141129 C14.0736057,12.7979839 13.9538476,11.9774194 13.9272347,11.1612903 C13.9494122,10.3451613 14.0736057,9.52459677 14.6236057,8.70846774 Z M7.52683151,8.70846774 C7.86392828,8.20282258 8.62239603,8.18951613 8.97723474,8.70846774 C9.52723474,9.52459677 9.6469928,10.3451613 9.6736057,11.1612903 C9.65142828,11.9774194 9.52723474,12.7979839 8.97723474,13.6141129 C8.64013796,14.1197581 7.88167022,14.1330645 7.52683151,13.6141129 C6.97683151,12.7979839 6.85707345,11.9774194 6.83046054,11.1612903 C6.85263796,10.3451613 6.97683151,9.52459677 7.52683151,8.70846774 Z M11.7982025,21.8064516 C9.11029925,21.8064516 5.83247667,20.1076613 5.41997667,17.6681452 C5.33126699,17.1447581 5.83247667,16.7100806 6.33812183,16.8741935 C7.67763796,17.3044355 9.66917022,17.5483871 11.7982025,17.5483871 C13.9272347,17.5483871 15.918767,17.3044355 17.2582831,16.8741935 C17.7639283,16.7100806 18.2607025,17.1447581 18.1764283,17.6681452 C17.7639283,20.1076613 14.4861057,21.8064516 11.7982025,21.8064516 Z" id="Shape" fill-rule="nonzero"></path>
            <text id="Add-success-message" font-family=".AppleSystemUIFont" font-size="17" font-weight="normal">
                <tspan x="36.1311048" y="17">Email address verified!</tspan>
            </text>
        </g>
        <g id="Group">
            <rect id="Rectangle-Copy-6" fill="#233554" x="0" y="0" width="1280" height="58"></rect>
            <g transform="translate(941.000000, 22.000000)" fill="#8892B0" id="Rectangle">
                <rect x="6" y="0" width="2" height="14"></rect>
                <rect transform="translate(7.000000, 7.000000) rotate(-270.000000) translate(-7.000000, -7.000000) " x="6" y="0" width="2" height="14"></rect>
            </g>
            <path d="M1246,18.5 C1240.48,18.5 1236,22.98 1236,28.5 C1236,34.02 1240.48,38.5 1246,38.5 C1251.52,38.5 1256,34.02 1256,28.5 C1256,22.98 1251.52,18.5 1246,18.5 Z M1246,21.5 C1247.66,21.5 1249,22.84 1249,24.5 C1249,26.16 1247.66,27.5 1246,27.5 C1244.34,27.5 1243,26.16 1243,24.5 C1243,22.84 1244.34,21.5 1246,21.5 Z M1246,35.7 C1243.5,35.7 1241.29,34.42 1240,32.48 C1240.03,30.49 1244,29.4 1246,29.4 C1247.99,29.4 1251.97,30.49 1252,32.48 C1250.71,34.42 1248.5,35.7 1246,35.7 Z" id="Shape-Copy" fill="#8892B0" fill-rule="nonzero"></path>
            <g opacity="0.257068452" transform="translate(24.000000, 11.500000)" stroke="#FFFFFF">
                <rect id="Rectangle" x="0" y="0" width="123" height="35"></rect>
                <line x1="1.5" y1="2" x2="121.5" y2="34" id="Line-3" stroke-linecap="square"></line>
                <line x1="1.5" y1="2" x2="121.5" y2="34" id="Line-3" stroke-linecap="square" transform="translate(61.500000, 18.000000) scale(-1, 1) translate(-61.500000, -18.000000) "></line>
            </g>
            <text id="My-checklists-Templa" font-family=".AppleSystemUIFont" font-size="14" font-weight="normal" fill="#8892B0">
                <tspan x="1003.38867" y="31">My checklists        Templates</tspan>
            </text>
            <line x1="1212" y1="-2.49800181e-16" x2="1212" y2="58" id="Line-5-Copy" stroke="#4F5D76" stroke-width="2"></line>
        </g>
    </g>
</svg>