<?xml version="1.0" encoding="UTF-8"?>
<svg width="1280px" height="1866px" viewBox="0 0 1280 1866" version="1.1" xmlns="http://www.w3.org/2000/svg" xmlns:xlink="http://www.w3.org/1999/xlink">
    <title>24-collapsed-tasks</title>
    <defs>
        <polygon id="path-1" points="1.62285375e-06 1.3355285e-05 8.97287892 1.3355285e-05 8.97287892 5.97914798 1.62285375e-06 5.97914798"></polygon>
        <polygon id="path-3" points="1.62285375e-06 1.3355285e-05 8.97287892 1.3355285e-05 8.97287892 5.97914798 1.62285375e-06 5.97914798"></polygon>
        <polygon id="path-5" points="1.62285375e-06 1.3355285e-05 8.97287892 1.3355285e-05 8.97287892 5.97914798 1.62285375e-06 5.97914798"></polygon>
        <polygon id="path-7" points="1.62285375e-06 1.3355285e-05 8.97287892 1.3355285e-05 8.97287892 5.97914798 1.62285375e-06 5.97914798"></polygon>
        <polygon id="path-9" points="1.62285375e-06 1.3355285e-05 8.97287892 1.3355285e-05 8.97287892 5.97914798 1.62285375e-06 5.97914798"></polygon>
        <polygon id="path-11" points="1.62285375e-06 1.3355285e-05 8.97287892 1.3355285e-05 8.97287892 5.97914798 1.62285375e-06 5.97914798"></polygon>
        <polygon id="path-13" points="1.62285375e-06 1.3355285e-05 8.97287892 1.3355285e-05 8.97287892 5.97914798 1.62285375e-06 5.97914798"></polygon>
        <polygon id="path-15" points="1.62285375e-06 1.3355285e-05 8.97287892 1.3355285e-05 8.97287892 5.97914798 1.62285375e-06 5.97914798"></polygon>
        <polygon id="path-17" points="1.62285375e-06 1.3355285e-05 8.97287892 1.3355285e-05 8.97287892 5.97914798 1.62285375e-06 5.97914798"></polygon>
        <polygon id="path-19" points="1.62285375e-06 1.3355285e-05 8.97287892 1.3355285e-05 8.97287892 5.97914798 1.62285375e-06 5.97914798"></polygon>
        <polygon id="path-21" points="1.62285375e-06 1.3355285e-05 8.97287892 1.3355285e-05 8.97287892 5.97914798 1.62285375e-06 5.97914798"></polygon>
        <polygon id="path-23" points="1.62285375e-06 1.3355285e-05 8.97287892 1.3355285e-05 8.97287892 5.97914798 1.62285375e-06 5.97914798"></polygon>
        <polygon id="path-25" points="1.62285375e-06 1.3355285e-05 8.97287892 1.3355285e-05 8.97287892 5.97914798 1.62285375e-06 5.97914798"></polygon>
        <polygon id="path-27" points="1.62285375e-06 1.3355285e-05 8.97287892 1.3355285e-05 8.97287892 5.97914798 1.62285375e-06 5.97914798"></polygon>
    </defs>
    <g id="24-collapsed-tasks" stroke="none" stroke-width="1" fill="none" fill-rule="evenodd">
        <rect fill="#0A192F" x="0" y="0" width="1280" height="1866"></rect>
        <g id="Group">
            <rect id="Rectangle-Copy-6" fill="#233554" x="0" y="0" width="1280" height="58"></rect>
            <g transform="translate(941.000000, 22.000000)" fill="#8892B0" id="Rectangle">
                <rect x="6" y="0" width="2" height="14"></rect>
                <rect transform="translate(7.000000, 7.000000) rotate(-270.000000) translate(-7.000000, -7.000000) " x="6" y="0" width="2" height="14"></rect>
            </g>
            <path d="M1246,18.5 C1240.48,18.5 1236,22.98 1236,28.5 C1236,34.02 1240.48,38.5 1246,38.5 C1251.52,38.5 1256,34.02 1256,28.5 C1256,22.98 1251.52,18.5 1246,18.5 Z M1246,21.5 C1247.66,21.5 1249,22.84 1249,24.5 C1249,26.16 1247.66,27.5 1246,27.5 C1244.34,27.5 1243,26.16 1243,24.5 C1243,22.84 1244.34,21.5 1246,21.5 Z M1246,35.7 C1243.5,35.7 1241.29,34.42 1240,32.48 C1240.03,30.49 1244,29.4 1246,29.4 C1247.99,29.4 1251.97,30.49 1252,32.48 C1250.71,34.42 1248.5,35.7 1246,35.7 Z" id="Shape-Copy" fill="#8892B0" fill-rule="nonzero"></path>
            <g opacity="0.257068452" transform="translate(24.000000, 11.500000)" stroke="#FFFFFF">
                <rect id="Rectangle" x="0" y="0" width="123" height="35"></rect>
                <line x1="1.5" y1="2" x2="121.5" y2="34" id="Line-3" stroke-linecap="square"></line>
                <line x1="1.5" y1="2" x2="121.5" y2="34" id="Line-3" stroke-linecap="square" transform="translate(61.500000, 18.000000) scale(-1, 1) translate(-61.500000, -18.000000) "></line>
            </g>
            <text id="My-checklists-Templa" font-family=".AppleSystemUIFont" font-size="14" font-weight="normal">
                <tspan x="1003.38867" y="31" fill="#FFFFFF">My checklists</tspan>
                <tspan x="1091.25098" y="31" fill="#8892B0">        Templates</tspan>
            </text>
            <line x1="1212" y1="-2.49800181e-16" x2="1212" y2="58" id="Line-5-Copy" stroke="#4F5D76" stroke-width="2"></line>
        </g>
        <text id="4-required-tasks-to" font-family=".AppleSystemUIFont" font-size="17" font-weight="normal" fill="#CCD6F6">
            <tspan x="129" y="1552.5">4 required tasks to go before you can complete the checklist.</tspan>
        </text>
        <g id="Group" transform="translate(129.000000, 1594.500000)" opacity="0.25">
            <g id="button---bright-outline">
                <rect id="Rectangle-Copy-2" stroke="#50CCAE" fill="#50CCAE" x="0.5" y="0.5" width="219" height="55" rx="3"></rect>
                <text id="Sign-up-with-email" font-family=".AppleSystemUIFont" font-size="17" font-weight="normal" fill="#020C1B">
                    <tspan x="37.1855469" y="30">Complete checklist</tspan>
                </text>
            </g>
        </g>
        <g id="complete-task---single-line" transform="translate(129.000000, 330.000000)">
            <text id="Read-more-about-this" font-family=".AppleSystemUIFont" font-size="17" font-weight="normal" fill="#CCD6F6">
                <tspan x="60" y="41">Learn more about this checklist</tspan>
            </text>
            <line x1="1.10805462e-16" y1="76.5" x2="1022" y2="76.5" id="Line-2-Copy-9" stroke="#4F5D76" stroke-width="2"></line>
            <g id="Group-3" transform="translate(14.070322, 26.000000)">
                <rect id="Rectangle-Copy-3" stroke="#64FFDA" stroke-width="2" fill="#64FFDA" x="1" y="1" width="22" height="22" rx="3"></rect>
                <path d="M19.8024229,8.34067785 L10.1930937,17.8728937 C9.93113091,18.1327407 9.50809304,18.1310704 9.248246,17.8691076 L4.19378414,12.7737228 C3.93393711,12.51176 3.93560743,12.0887221 4.19762589,11.8288194 L5.4625637,10.5740706 C5.72452648,10.3142236 6.14756435,10.3158939 6.40741138,10.5779124 L9.73648227,13.9339868 L17.6066125,6.12710628 C17.8685753,5.86725925 18.2916132,5.86892958 18.5514602,6.13089236 L19.806209,7.39577449 C20.066056,7.65779294 20.0643857,8.08083082 19.8024229,8.34067785 Z" id="Path-Copy" fill="#020C1B"></path>
            </g>
        </g>
        <g id="complete-task---single-line-copy-4" transform="translate(129.000000, 406.500000)">
            <text id="Read-more-about-this" font-family=".AppleSystemUIFont" font-size="17" font-weight="normal" fill="#CCD6F6">
                <tspan x="60" y="41">Select your vacation type</tspan>
            </text>
            <line x1="1.10805462e-16" y1="76.5" x2="1022" y2="76.5" id="Line-2-Copy-9" stroke="#4F5D76" stroke-width="2"></line>
            <g id="Group-3" transform="translate(14.070322, 26.000000)">
                <rect id="Rectangle-Copy-3" stroke="#64FFDA" stroke-width="2" fill="#64FFDA" x="1" y="1" width="22" height="22" rx="3"></rect>
                <path d="M19.8024229,8.34067785 L10.1930937,17.8728937 C9.93113091,18.1327407 9.50809304,18.1310704 9.248246,17.8691076 L4.19378414,12.7737228 C3.93393711,12.51176 3.93560743,12.0887221 4.19762589,11.8288194 L5.4625637,10.5740706 C5.72452648,10.3142236 6.14756435,10.3158939 6.40741138,10.5779124 L9.73648227,13.9339868 L17.6066125,6.12710628 C17.8685753,5.86725925 18.2916132,5.86892958 18.5514602,6.13089236 L19.806209,7.39577449 C20.066056,7.65779294 20.0643857,8.08083082 19.8024229,8.34067785 Z" id="Path-Copy" fill="#020C1B"></path>
            </g>
        </g>
        <g id="task---single-line" transform="translate(129.000000, 484.000000)">
            <text id="Read-more-about-this" font-family=".AppleSystemUIFont" font-size="17" font-weight="normal" fill="#CCD6F6">
                <tspan x="60" y="41">Enter your vacation dates</tspan>
            </text>
            <line x1="1.10805462e-16" y1="76.5" x2="1022" y2="76.5" id="Line-2-Copy-9" stroke="#4F5D76" stroke-width="2"></line>
            <g id="Group-3" transform="translate(14.070322, 26.000000)">
                <rect id="Rectangle-Copy-3" stroke="#64FFDA" stroke-width="2" fill="#64FFDA" x="1" y="1" width="22" height="22" rx="3"></rect>
                <path d="M19.8024229,8.34067785 L10.1930937,17.8728937 C9.93113091,18.1327407 9.50809304,18.1310704 9.248246,17.8691076 L4.19378414,12.7737228 C3.93393711,12.51176 3.93560743,12.0887221 4.19762589,11.8288194 L5.4625637,10.5740706 C5.72452648,10.3142236 6.14756435,10.3158939 6.40741138,10.5779124 L9.73648227,13.9339868 L17.6066125,6.12710628 C17.8685753,5.86725925 18.2916132,5.86892958 18.5514602,6.13089236 L19.806209,7.39577449 C20.066056,7.65779294 20.0643857,8.08083082 19.8024229,8.34067785 Z" id="Path-Copy" fill="#020C1B"></path>
            </g>
        </g>
        <g id="task---single-line-copy" transform="translate(129.000000, 561.000000)">
            <g id="Group" transform="translate(14.000000, 26.500000)" stroke="#8892B0" stroke-width="2">
                <g id="Rectangle-Copy">
                    <rect x="1" y="1" width="22" height="22" rx="3"></rect>
                </g>
            </g>
            <text id="Enter-your-vacation" font-family=".AppleSystemUIFont" font-size="17" font-weight="normal" fill="#CCD6F6">
                <tspan x="60" y="42">Check the team calendar to see if anyone has booked the same dates off</tspan>
            </text>
            <line x1="1.10805462e-16" y1="76.5" x2="1022" y2="76.5" id="Line-2-Copy-9" stroke="#4F5D76" stroke-width="2"></line>
        </g>
        <g id="task---single-line-copy-12" transform="translate(129.000000, 715.000000)">
            <g id="Group" transform="translate(14.000000, 26.500000)" stroke="#8892B0" stroke-width="2">
                <g id="Rectangle-Copy">
                    <rect x="1" y="1" width="22" height="22" rx="3"></rect>
                </g>
            </g>
            <text id="Enter-your-vacation" font-family=".AppleSystemUIFont" font-size="17" font-weight="normal" fill="#CCD6F6">
                <tspan x="60" y="42">Confirm whether you are an epic owner</tspan>
            </text>
            <line x1="1.10805462e-16" y1="76.5" x2="1022" y2="76.5" id="Line-2-Copy-9" stroke="#4F5D76" stroke-width="2"></line>
        </g>
        <g id="task---single-line-copy-20" transform="translate(129.000000, 791.000000)">
            <g id="Group" transform="translate(14.000000, 26.500000)" stroke="#8892B0" stroke-width="2">
                <g id="Rectangle-Copy">
                    <rect x="1" y="1" width="22" height="22" rx="3"></rect>
                </g>
            </g>
            <text id="Enter-your-vacation" font-family=".AppleSystemUIFont" font-size="17" font-weight="normal" fill="#CCD6F6">
                <tspan x="60" y="42">Confirm whether you are an epic reviewer</tspan>
            </text>
            <line x1="1.10805462e-16" y1="76.5" x2="1022" y2="76.5" id="Line-2-Copy-9" stroke="#4F5D76" stroke-width="2"></line>
        </g>
        <g id="task---single-line-copy-14" transform="translate(129.000000, 1175.000000)">
            <g id="Group" transform="translate(14.000000, 26.500000)" stroke="#8892B0" stroke-width="2">
                <g id="Rectangle-Copy">
                    <rect x="1" y="1" width="22" height="22" rx="3"></rect>
                </g>
            </g>
            <text id="Enter-your-vacation" font-family=".AppleSystemUIFont" font-size="17" font-weight="normal" fill="#CCD6F6">
                <tspan x="60" y="42">Confirm whether there are any newcomer reviews assigned to you while you’re away</tspan>
            </text>
            <line x1="1.10805462e-16" y1="76.5" x2="1022" y2="76.5" id="Line-2-Copy-9" stroke="#4F5D76" stroke-width="2"></line>
        </g>
        <g id="task---single-line-copy-17" transform="translate(129.000000, 1252.000000)">
            <g id="Group" transform="translate(14.000000, 26.500000)" stroke="#8892B0" stroke-width="2">
                <g id="Rectangle-Copy">
                    <rect x="1" y="1" width="22" height="22" rx="3"></rect>
                </g>
            </g>
            <text id="Enter-your-vacation" font-family=".AppleSystemUIFont" font-size="17" font-weight="normal" fill="#CCD6F6">
                <tspan x="60" y="42">Confirm whether there are any outstanding tasks or reviews assigned to you while you’re away</tspan>
            </text>
            <line x1="1.10805462e-16" y1="76.5" x2="1022" y2="76.5" id="Line-2-Copy-9" stroke="#4F5D76" stroke-width="2"></line>
        </g>
        <g id="task---single-line-copy-18" transform="translate(129.000000, 1328.500000)">
            <g id="Group" transform="translate(14.000000, 26.500000)" stroke="#8892B0" stroke-width="2">
                <g id="Rectangle-Copy">
                    <rect x="1" y="1" width="22" height="22" rx="3"></rect>
                </g>
            </g>
            <text id="Enter-your-vacation" font-family=".AppleSystemUIFont" font-size="17" font-weight="normal" fill="#CCD6F6">
                <tspan x="60" y="42">Complete all items on the sprint checklist before you leave</tspan>
            </text>
            <line x1="1.10805462e-16" y1="76.5" x2="1022" y2="76.5" id="Line-2-Copy-9" stroke="#4F5D76" stroke-width="2"></line>
        </g>
        <g id="task---single-line-copy-19" transform="translate(129.000000, 1405.500000)">
            <g id="Group" transform="translate(14.000000, 26.500000)" stroke="#8892B0" stroke-width="2">
                <g id="Rectangle-Copy">
                    <rect x="1" y="1" width="22" height="22" rx="3"></rect>
                </g>
            </g>
            <text id="Enter-your-vacation" font-family=".AppleSystemUIFont" font-size="17" font-weight="normal" fill="#CCD6F6">
                <tspan x="60" y="42">Set a vacation responder</tspan>
            </text>
            <line x1="1.10805462e-16" y1="76.5" x2="1022" y2="76.5" id="Line-2-Copy-9" stroke="#4F5D76" stroke-width="2"></line>
        </g>
        <g id="task---single-line-copy-13" transform="translate(129.000000, 867.000000)">
            <g id="Group" transform="translate(14.000000, 26.500000)" stroke="#8892B0" stroke-width="2">
                <g id="Rectangle-Copy">
                    <rect x="1" y="1" width="22" height="22" rx="3"></rect>
                </g>
            </g>
            <text id="Enter-your-vacation" font-family=".AppleSystemUIFont" font-size="17" font-weight="normal" fill="#CCD6F6">
                <tspan x="60" y="42">Confirm whether you are a client owner</tspan>
            </text>
            <line x1="1.10805462e-16" y1="76.5" x2="1022" y2="76.5" id="Line-2-Copy-9" stroke="#4F5D76" stroke-width="2"></line>
        </g>
        <g id="task---single-line-copy-15" transform="translate(129.000000, 945.000000)">
            <g id="Group" transform="translate(14.000000, 26.500000)" stroke="#8892B0" stroke-width="2">
                <g id="Rectangle-Copy">
                    <rect x="1" y="1" width="22" height="22" rx="3"></rect>
                </g>
            </g>
            <text id="Enter-your-vacation" font-family=".AppleSystemUIFont" font-size="17" font-weight="normal" fill="#CCD6F6">
                <tspan x="60" y="42">Confirm whether you have roles or rotations assigned to you while you're away</tspan>
            </text>
            <line x1="1.10805462e-16" y1="76.5" x2="1022" y2="76.5" id="Line-2-Copy-9" stroke="#4F5D76" stroke-width="2"></line>
        </g>
        <g id="task---single-line-copy-21" transform="translate(129.000000, 1021.000000)">
            <g id="Group" transform="translate(14.000000, 26.500000)" stroke="#8892B0" stroke-width="2">
                <g id="Rectangle-Copy">
                    <rect x="1" y="1" width="22" height="22" rx="3"></rect>
                </g>
            </g>
            <text id="Enter-your-vacation" font-family=".AppleSystemUIFont" font-size="17" font-weight="normal" fill="#CCD6F6">
                <tspan x="60" y="42">Announce your vacation on the forum</tspan>
            </text>
            <line x1="1.10805462e-16" y1="76.5" x2="1022" y2="76.5" id="Line-2-Copy-9" stroke="#4F5D76" stroke-width="2"></line>
        </g>
        <g id="task---single-line-copy-16" transform="translate(129.000000, 1098.000000)">
            <g id="Group" transform="translate(14.000000, 26.500000)" stroke="#8892B0" stroke-width="2">
                <g id="Rectangle-Copy">
                    <rect x="1" y="1" width="22" height="22" rx="3"></rect>
                </g>
            </g>
            <text id="Enter-your-vacation" font-family=".AppleSystemUIFont" font-size="17" font-weight="normal" fill="#CCD6F6">
                <tspan x="60" y="42">Open the calendar event you created and add a link to the forum post</tspan>
            </text>
            <line x1="1.10805462e-16" y1="76.5" x2="1022" y2="76.5" id="Line-2-Copy-9" stroke="#4F5D76" stroke-width="2"></line>
        </g>
        <g id="task---single-line-copy-2" transform="translate(129.000000, 638.500000)">
            <g id="Group" transform="translate(14.000000, 26.500000)" stroke="#8892B0" stroke-width="2">
                <g id="Rectangle-Copy">
                    <rect x="1" y="1" width="22" height="22" rx="3"></rect>
                </g>
            </g>
            <text id="Enter-your-vacation" font-family=".AppleSystemUIFont" font-size="17" font-weight="normal" fill="#CCD6F6">
                <tspan x="60" y="42">Add your vacation to the calendar</tspan>
            </text>
            <line x1="1.10805462e-16" y1="76.5" x2="1022" y2="76.5" id="Line-2-Copy-9" stroke="#4F5D76" stroke-width="2"></line>
        </g>
        <g id="Group" transform="translate(480.000000, 638.000000)">
            <g id="Group-3" transform="translate(15.000000, 38.500000) rotate(-90.000000) translate(-15.000000, -38.500000) translate(10.363636, 35.500000)">
                <mask id="mask-2" fill="white">
                    <use xlink:href="#path-1"></use>
                </mask>
                <g id="Clip-2"></g>
                <path d="M4.48643677,5.97914798 C4.20050852,5.97914798 3.92870583,5.85476233 3.74179103,5.63838565 L0.0757641256,1.3943139 C-0.0366753363,1.2641435 -0.0223076233,1.06748879 0.10786278,0.955049327 L1.12579103,0.0757668161 C1.25593453,-0.0366726457 1.45258924,-0.0222780269 1.5650287,0.107865471 L4.48643677,3.48987444 L7.40784484,0.107865471 C7.5202843,-0.0222780269 7.71693901,-0.0366726457 7.84710942,0.0757668161 L8.86503767,0.955076233 C8.99518117,1.06748879 9.00957578,1.2641704 8.89713632,1.3943139 L5.23108251,5.63838565 C5.04416771,5.85476233 4.77236502,5.97914798 4.48643677,5.97914798" id="Fill-1" fill="#8892B0" mask="url(#mask-2)"></path>
            </g>
        </g>
        <g id="Group" transform="translate(451.000000, 330.000000)">
            <g id="Group-3" transform="translate(15.000000, 38.500000) rotate(-90.000000) translate(-15.000000, -38.500000) translate(10.363636, 35.500000)">
                <mask id="mask-4" fill="white">
                    <use xlink:href="#path-3"></use>
                </mask>
                <g id="Clip-2"></g>
                <path d="M4.48643677,5.97914798 C4.20050852,5.97914798 3.92870583,5.85476233 3.74179103,5.63838565 L0.0757641256,1.3943139 C-0.0366753363,1.2641435 -0.0223076233,1.06748879 0.10786278,0.955049327 L1.12579103,0.0757668161 C1.25593453,-0.0366726457 1.45258924,-0.0222780269 1.5650287,0.107865471 L4.48643677,3.48987444 L7.40784484,0.107865471 C7.5202843,-0.0222780269 7.71693901,-0.0366726457 7.84710942,0.0757668161 L8.86503767,0.955076233 C8.99518117,1.06748879 9.00957578,1.2641704 8.89713632,1.3943139 L5.23108251,5.63838565 C5.04416771,5.85476233 4.77236502,5.97914798 4.48643677,5.97914798" id="Fill-1" fill="#8892B0" mask="url(#mask-4)"></path>
            </g>
        </g>
        <g id="Group" transform="translate(403.000000, 406.500000)">
            <g id="Group-3" transform="translate(15.000000, 38.500000) rotate(-90.000000) translate(-15.000000, -38.500000) translate(10.363636, 35.500000)">
                <mask id="mask-6" fill="white">
                    <use xlink:href="#path-5"></use>
                </mask>
                <g id="Clip-2"></g>
                <path d="M4.48643677,5.97914798 C4.20050852,5.97914798 3.92870583,5.85476233 3.74179103,5.63838565 L0.0757641256,1.3943139 C-0.0366753363,1.2641435 -0.0223076233,1.06748879 0.10786278,0.955049327 L1.12579103,0.0757668161 C1.25593453,-0.0366726457 1.45258924,-0.0222780269 1.5650287,0.107865471 L4.48643677,3.48987444 L7.40784484,0.107865471 C7.5202843,-0.0222780269 7.71693901,-0.0366726457 7.84710942,0.0757668161 L8.86503767,0.955076233 C8.99518117,1.06748879 9.00957578,1.2641704 8.89713632,1.3943139 L5.23108251,5.63838565 C5.04416771,5.85476233 4.77236502,5.97914798 4.48643677,5.97914798" id="Fill-1" fill="#8892B0" mask="url(#mask-6)"></path>
            </g>
        </g>
        <g id="Group" transform="translate(407.000000, 483.500000)">
            <g id="Group-3" transform="translate(15.000000, 38.500000) rotate(-90.000000) translate(-15.000000, -38.500000) translate(10.363636, 35.500000)">
                <mask id="mask-8" fill="white">
                    <use xlink:href="#path-7"></use>
                </mask>
                <g id="Clip-2"></g>
                <path d="M4.48643677,5.97914798 C4.20050852,5.97914798 3.92870583,5.85476233 3.74179103,5.63838565 L0.0757641256,1.3943139 C-0.0366753363,1.2641435 -0.0223076233,1.06748879 0.10786278,0.955049327 L1.12579103,0.0757668161 C1.25593453,-0.0366726457 1.45258924,-0.0222780269 1.5650287,0.107865471 L4.48643677,3.48987444 L7.40784484,0.107865471 C7.5202843,-0.0222780269 7.71693901,-0.0366726457 7.84710942,0.0757668161 L8.86503767,0.955076233 C8.99518117,1.06748879 9.00957578,1.2641704 8.89713632,1.3943139 L5.23108251,5.63838565 C5.04416771,5.85476233 4.77236502,5.97914798 4.48643677,5.97914798" id="Fill-1" fill="#8892B0" mask="url(#mask-8)"></path>
            </g>
        </g>
        <g id="Group" transform="translate(820.847844, 560.500000)">
            <g id="Group-3" transform="translate(15.000000, 38.500000) rotate(-90.000000) translate(-15.000000, -38.500000) translate(10.363636, 35.500000)">
                <mask id="mask-10" fill="white">
                    <use xlink:href="#path-9"></use>
                </mask>
                <g id="Clip-2"></g>
                <path d="M4.48643677,5.97914798 C4.20050852,5.97914798 3.92870583,5.85476233 3.74179103,5.63838565 L0.0757641256,1.3943139 C-0.0366753363,1.2641435 -0.0223076233,1.06748879 0.10786278,0.955049327 L1.12579103,0.0757668161 C1.25593453,-0.0366726457 1.45258924,-0.0222780269 1.5650287,0.107865471 L4.48643677,3.48987444 L7.40784484,0.107865471 C7.5202843,-0.0222780269 7.71693901,-0.0366726457 7.84710942,0.0757668161 L8.86503767,0.955076233 C8.99518117,1.06748879 9.00957578,1.2641704 8.89713632,1.3943139 L5.23108251,5.63838565 C5.04416771,5.85476233 4.77236502,5.97914798 4.48643677,5.97914798" id="Fill-1" fill="#8892B0" mask="url(#mask-10)"></path>
            </g>
        </g>
        <g id="Group" transform="translate(526.500000, 715.500000)">
            <g id="Group-3" transform="translate(15.000000, 38.500000) rotate(-90.000000) translate(-15.000000, -38.500000) translate(10.363636, 35.500000)">
                <mask id="mask-12" fill="white">
                    <use xlink:href="#path-11"></use>
                </mask>
                <g id="Clip-2"></g>
                <path d="M4.48643677,5.97914798 C4.20050852,5.97914798 3.92870583,5.85476233 3.74179103,5.63838565 L0.0757641256,1.3943139 C-0.0366753363,1.2641435 -0.0223076233,1.06748879 0.10786278,0.955049327 L1.12579103,0.0757668161 C1.25593453,-0.0366726457 1.45258924,-0.0222780269 1.5650287,0.107865471 L4.48643677,3.48987444 L7.40784484,0.107865471 C7.5202843,-0.0222780269 7.71693901,-0.0366726457 7.84710942,0.0757668161 L8.86503767,0.955076233 C8.99518117,1.06748879 9.00957578,1.2641704 8.89713632,1.3943139 L5.23108251,5.63838565 C5.04416771,5.85476233 4.77236502,5.97914798 4.48643677,5.97914798" id="Fill-1" fill="#8892B0" mask="url(#mask-12)"></path>
            </g>
        </g>
        <g id="Group" transform="translate(544.500000, 791.500000)">
            <g id="Group-3" transform="translate(15.000000, 38.500000) rotate(-90.000000) translate(-15.000000, -38.500000) translate(10.363636, 35.500000)">
                <mask id="mask-14" fill="white">
                    <use xlink:href="#path-13"></use>
                </mask>
                <g id="Clip-2"></g>
                <path d="M4.48643677,5.97914798 C4.20050852,5.97914798 3.92870583,5.85476233 3.74179103,5.63838565 L0.0757641256,1.3943139 C-0.0366753363,1.2641435 -0.0223076233,1.06748879 0.10786278,0.955049327 L1.12579103,0.0757668161 C1.25593453,-0.0366726457 1.45258924,-0.0222780269 1.5650287,0.107865471 L4.48643677,3.48987444 L7.40784484,0.107865471 C7.5202843,-0.0222780269 7.71693901,-0.0366726457 7.84710942,0.0757668161 L8.86503767,0.955076233 C8.99518117,1.06748879 9.00957578,1.2641704 8.89713632,1.3943139 L5.23108251,5.63838565 C5.04416771,5.85476233 4.77236502,5.97914798 4.48643677,5.97914798" id="Fill-1" fill="#8892B0" mask="url(#mask-14)"></path>
            </g>
        </g>
        <g id="Group" transform="translate(905.000000, 1174.000000)">
            <g id="Group-3" transform="translate(15.000000, 38.500000) rotate(-90.000000) translate(-15.000000, -38.500000) translate(10.363636, 35.500000)">
                <mask id="mask-16" fill="white">
                    <use xlink:href="#path-15"></use>
                </mask>
                <g id="Clip-2"></g>
                <path d="M4.48643677,5.97914798 C4.20050852,5.97914798 3.92870583,5.85476233 3.74179103,5.63838565 L0.0757641256,1.3943139 C-0.0366753363,1.2641435 -0.0223076233,1.06748879 0.10786278,0.955049327 L1.12579103,0.0757668161 C1.25593453,-0.0366726457 1.45258924,-0.0222780269 1.5650287,0.107865471 L4.48643677,3.48987444 L7.40784484,0.107865471 C7.5202843,-0.0222780269 7.71693901,-0.0366726457 7.84710942,0.0757668161 L8.86503767,0.955076233 C8.99518117,1.06748879 9.00957578,1.2641704 8.89713632,1.3943139 L5.23108251,5.63838565 C5.04416771,5.85476233 4.77236502,5.97914798 4.48643677,5.97914798" id="Fill-1" fill="#8892B0" mask="url(#mask-16)"></path>
            </g>
        </g>
        <g id="Group" transform="translate(991.000000, 1251.000000)">
            <g id="Group-3" transform="translate(15.000000, 38.500000) rotate(-90.000000) translate(-15.000000, -38.500000) translate(10.363636, 35.500000)">
                <mask id="mask-18" fill="white">
                    <use xlink:href="#path-17"></use>
                </mask>
                <g id="Clip-2"></g>
                <path d="M4.48643677,5.97914798 C4.20050852,5.97914798 3.92870583,5.85476233 3.74179103,5.63838565 L0.0757641256,1.3943139 C-0.0366753363,1.2641435 -0.0223076233,1.06748879 0.10786278,0.955049327 L1.12579103,0.0757668161 C1.25593453,-0.0366726457 1.45258924,-0.0222780269 1.5650287,0.107865471 L4.48643677,3.48987444 L7.40784484,0.107865471 C7.5202843,-0.0222780269 7.71693901,-0.0366726457 7.84710942,0.0757668161 L8.86503767,0.955076233 C8.99518117,1.06748879 9.00957578,1.2641704 8.89713632,1.3943139 L5.23108251,5.63838565 C5.04416771,5.85476233 4.77236502,5.97914798 4.48643677,5.97914798" id="Fill-1" fill="#8892B0" mask="url(#mask-18)"></path>
            </g>
        </g>
        <g id="Group" transform="translate(684.000000, 1329.000000)">
            <g id="Group-3" transform="translate(15.000000, 38.500000) rotate(-90.000000) translate(-15.000000, -38.500000) translate(10.363636, 35.500000)">
                <mask id="mask-20" fill="white">
                    <use xlink:href="#path-19"></use>
                </mask>
                <g id="Clip-2"></g>
                <path d="M4.48643677,5.97914798 C4.20050852,5.97914798 3.92870583,5.85476233 3.74179103,5.63838565 L0.0757641256,1.3943139 C-0.0366753363,1.2641435 -0.0223076233,1.06748879 0.10786278,0.955049327 L1.12579103,0.0757668161 C1.25593453,-0.0366726457 1.45258924,-0.0222780269 1.5650287,0.107865471 L4.48643677,3.48987444 L7.40784484,0.107865471 C7.5202843,-0.0222780269 7.71693901,-0.0366726457 7.84710942,0.0757668161 L8.86503767,0.955076233 C8.99518117,1.06748879 9.00957578,1.2641704 8.89713632,1.3943139 L5.23108251,5.63838565 C5.04416771,5.85476233 4.77236502,5.97914798 4.48643677,5.97914798" id="Fill-1" fill="#8892B0" mask="url(#mask-20)"></path>
            </g>
        </g>
        <g id="Group" transform="translate(526.500000, 867.500000)">
            <g id="Group-3" transform="translate(15.000000, 38.500000) rotate(-90.000000) translate(-15.000000, -38.500000) translate(10.363636, 35.500000)">
                <mask id="mask-22" fill="white">
                    <use xlink:href="#path-21"></use>
                </mask>
                <g id="Clip-2"></g>
                <path d="M4.48643677,5.97914798 C4.20050852,5.97914798 3.92870583,5.85476233 3.74179103,5.63838565 L0.0757641256,1.3943139 C-0.0366753363,1.2641435 -0.0223076233,1.06748879 0.10786278,0.955049327 L1.12579103,0.0757668161 C1.25593453,-0.0366726457 1.45258924,-0.0222780269 1.5650287,0.107865471 L4.48643677,3.48987444 L7.40784484,0.107865471 C7.5202843,-0.0222780269 7.71693901,-0.0366726457 7.84710942,0.0757668161 L8.86503767,0.955076233 C8.99518117,1.06748879 9.00957578,1.2641704 8.89713632,1.3943139 L5.23108251,5.63838565 C5.04416771,5.85476233 4.77236502,5.97914798 4.48643677,5.97914798" id="Fill-1" fill="#8892B0" mask="url(#mask-22)"></path>
            </g>
        </g>
        <g id="Group" transform="translate(857.000000, 945.500000)">
            <g id="Group-3" transform="translate(15.000000, 38.500000) rotate(-90.000000) translate(-15.000000, -38.500000) translate(10.363636, 35.500000)">
                <mask id="mask-24" fill="white">
                    <use xlink:href="#path-23"></use>
                </mask>
                <g id="Clip-2"></g>
                <path d="M4.48643677,5.97914798 C4.20050852,5.97914798 3.92870583,5.85476233 3.74179103,5.63838565 L0.0757641256,1.3943139 C-0.0366753363,1.2641435 -0.0223076233,1.06748879 0.10786278,0.955049327 L1.12579103,0.0757668161 C1.25593453,-0.0366726457 1.45258924,-0.0222780269 1.5650287,0.107865471 L4.48643677,3.48987444 L7.40784484,0.107865471 C7.5202843,-0.0222780269 7.71693901,-0.0366726457 7.84710942,0.0757668161 L8.86503767,0.955076233 C8.99518117,1.06748879 9.00957578,1.2641704 8.89713632,1.3943139 L5.23108251,5.63838565 C5.04416771,5.85476233 4.77236502,5.97914798 4.48643677,5.97914798" id="Fill-1" fill="#8892B0" mask="url(#mask-24)"></path>
            </g>
        </g>
        <g id="Group" transform="translate(508.500000, 1021.500000)">
            <g id="Group-3" transform="translate(15.000000, 38.500000) rotate(-90.000000) translate(-15.000000, -38.500000) translate(10.363636, 35.500000)">
                <mask id="mask-26" fill="white">
                    <use xlink:href="#path-25"></use>
                </mask>
                <g id="Clip-2"></g>
                <path d="M4.48643677,5.97914798 C4.20050852,5.97914798 3.92870583,5.85476233 3.74179103,5.63838565 L0.0757641256,1.3943139 C-0.0366753363,1.2641435 -0.0223076233,1.06748879 0.10786278,0.955049327 L1.12579103,0.0757668161 C1.25593453,-0.0366726457 1.45258924,-0.0222780269 1.5650287,0.107865471 L4.48643677,3.48987444 L7.40784484,0.107865471 C7.5202843,-0.0222780269 7.71693901,-0.0366726457 7.84710942,0.0757668161 L8.86503767,0.955076233 C8.99518117,1.06748879 9.00957578,1.2641704 8.89713632,1.3943139 L5.23108251,5.63838565 C5.04416771,5.85476233 4.77236502,5.97914798 4.48643677,5.97914798" id="Fill-1" fill="#8892B0" mask="url(#mask-26)"></path>
            </g>
        </g>
        <g id="Group" transform="translate(786.000000, 1098.500000)">
            <g id="Group-3" transform="translate(15.000000, 38.500000) rotate(-90.000000) translate(-15.000000, -38.500000) translate(10.363636, 35.500000)">
                <mask id="mask-28" fill="white">
                    <use xlink:href="#path-27"></use>
                </mask>
                <g id="Clip-2"></g>
                <path d="M4.48643677,5.97914798 C4.20050852,5.97914798 3.92870583,5.85476233 3.74179103,5.63838565 L0.0757641256,1.3943139 C-0.0366753363,1.2641435 -0.0223076233,1.06748879 0.10786278,0.955049327 L1.12579103,0.0757668161 C1.25593453,-0.0366726457 1.45258924,-0.0222780269 1.5650287,0.107865471 L4.48643677,3.48987444 L7.40784484,0.107865471 C7.5202843,-0.0222780269 7.71693901,-0.0366726457 7.84710942,0.0757668161 L8.86503767,0.955076233 C8.99518117,1.06748879 9.00957578,1.2641704 8.89713632,1.3943139 L5.23108251,5.63838565 C5.04416771,5.85476233 4.77236502,5.97914798 4.48643677,5.97914798" id="Fill-1" fill="#8892B0" mask="url(#mask-28)"></path>
            </g>
        </g>
        <line x1="185.5" y1="368.5" x2="480" y2="368.5" id="Line-Copy-5" stroke="#CCD6F6" stroke-linecap="square"></line>
        <text id="4-of-16-complete" font-family=".AppleSystemUIFont" font-size="14" font-weight="normal" fill="#A8B2D1">
            <tspan x="128" y="291">4 of 16 complete</tspan>
        </text>
        <text id="Vacation-checklist-f" font-family=".AppleSystemUIFont" font-size="40" font-weight="normal" fill="#CCD6F6">
            <tspan x="128" y="199.5">Vacation checklist for developers</tspan>
        </text>
        <text id="Use-this-checklist-w" font-family=".AppleSystemUIFont" font-size="17" font-weight="normal" fill="#CCD6F6">
            <tspan x="128" y="242.5">Use this checklist when you need to schedule a vacation</tspan>
        </text>
        <line x1="129" y1="330.5" x2="1151" y2="330.5" id="Line-2-Copy-16" stroke="#4F5D76" stroke-width="2"></line>
        <line x1="185.5" y1="522" x2="430" y2="522" id="Line-Copy-3" stroke="#CCD6F6" stroke-linecap="square"></line>
        <g id="Group" transform="translate(1086.000000, 191.500000)" fill="#64FFDA">
            <path d="M14.7565758,8.58005354 L9.6002074,4.16978049 C9.14885964,3.78369842 8.43750204,4.09711987 8.43750204,4.69686013 L8.43750204,7.0198235 C3.73157317,7.07318727 0,8.00735788 0,12.4246242 C0,14.207508 1.15959989,15.9737645 2.44139708,16.8971985 C2.84138741,17.1853745 3.41144614,16.8236964 3.26396563,16.3565676 C1.93552781,12.1486067 3.89405368,11.0314788 8.43750204,10.96674 L8.43750204,13.5178415 C8.43750204,14.1185103 9.14941628,14.4305389 9.6002074,14.0449211 L14.7565758,9.63421282 C15.0809216,9.35674445 15.0813611,8.85789914 14.7565758,8.58005354 Z" id="Path" fill-rule="nonzero"></path>
            <text id="Share" font-family=".AppleSystemUIFont" font-size="14" font-weight="normal">
                <tspan x="23" y="12">Share</tspan>
            </text>
        </g>
        <line x1="185.5" y1="445" x2="430" y2="445" id="Line-Copy-2" stroke="#CCD6F6" stroke-linecap="square"></line>
        <rect id="Rectangle" fill="#64FFDA" x="0" y="58" width="382" height="3"></rect>
    </g>
</svg>