<?xml version="1.0" encoding="UTF-8"?>
<svg width="1280px" height="1958px" viewBox="0 0 1280 1958" version="1.1" xmlns="http://www.w3.org/2000/svg" xmlns:xlink="http://www.w3.org/1999/xlink">
    <title>2-fonts-and-colours</title>
    <g id="2-fonts-and-colours" stroke="none" stroke-width="1" fill="none" fill-rule="evenodd">
        <rect fill="#FFFFFF" x="0" y="0" width="1280" height="1958"></rect>
        <text id="H1:-40px-H2:-37px-H3" font-family=".AppleSystemUIFont" font-size="29" font-weight="normal" line-spacing="55" fill="#565656">
            <tspan x="1066.99316" y="1454">H1: 40px </tspan>
            <tspan x="1059.20508" y="1509"> H2: 37px </tspan>
            <tspan x="1063.11328" y="1564">H3: 34px</tspan>
            <tspan x="1062.68848" y="1619">H4: 30px </tspan>
            <tspan x="1063.69385" y="1674">H5: 26px</tspan>
            <tspan x="1064.24609" y="1729">H6: 22px</tspan>
        </text>
        <rect id="Rectangle-Copy" fill="#233554" x="0" y="1260" width="1280" height="58"></rect>
        <text id="TYPOGRAPHY" font-family=".AppleSystemUIFont" font-size="23" font-weight="normal" fill="#FFFFFF">
            <tspan x="34.827057" y="1292">TYPOGRAPHY</tspan>
        </text>
        <rect id="Rectangle-Copy" fill="#233554" x="0" y="0" width="1280" height="53"></rect>
        <text id="COLOURS" font-family=".AppleSystemUIFont" font-size="20" font-weight="normal" fill="#FFFFFF">
            <tspan x="66.9371147" y="31">COLOURS</tspan>
        </text>
        <path d="M206.25,85.75 L206.25,284.25 L27.75,284.25 L27.75,85.75 L206.25,85.75 Z" id="border" stroke="#C8C8C8" stroke-width="1.5"></path>
        <path d="M206.25,85.75 L206.25,214.25 L27.75,214.25 L27.75,85.75 L206.25,85.75 Z" id="#FFFFFF" stroke="#C8C8C8" stroke-width="1.5" fill="#020C1B"></path>
        <text id="Darkest-navy" font-family="HelveticaNeue-Bold, Helvetica Neue" font-size="15" font-weight="bold" fill="#565656">
            <tspan x="35.625" y="237">Darkest navy</tspan>
        </text>
        <text id="#020c1b" font-family="HelveticaNeue, Helvetica Neue" font-size="13" font-weight="normal" fill="#8A8A8A">
            <tspan x="35.17" y="256">#020c1b</tspan>
        </text>
        <path d="M206.25,308.75 L206.25,507.25 L27.75,507.25 L27.75,308.75 L206.25,308.75 Z" id="border" stroke="#C8C8C8" stroke-width="1.5"></path>
        <path d="M206.25,308.75 L206.25,437.25 L27.75,437.25 L27.75,308.75 L206.25,308.75 Z" id="#FFFFFF" stroke="#C8C8C8" stroke-width="1.5" fill="#8892B0"></path>
        <text id="Dark-slate" font-family="HelveticaNeue-Bold, Helvetica Neue" font-size="15" font-weight="bold" fill="#565656">
            <tspan x="35.235" y="460">Dark slate</tspan>
        </text>
        <text id="#8892b0" font-family="HelveticaNeue, Helvetica Neue" font-size="13" font-weight="normal" fill="#8A8A8A">
            <tspan x="35.923" y="479">#8892b0</tspan>
        </text>
        <path d="M206.25,531.75 L206.25,730.25 L27.75,730.25 L27.75,531.75 L206.25,531.75 Z" id="border" stroke="#C8C8C8" stroke-width="1.5"></path>
        <path d="M206.25,531.75 L206.25,660.25 L27.75,660.25 L27.75,531.75 L206.25,531.75 Z" id="#FFFFFF" stroke="#C8C8C8" stroke-width="1.5" fill="#50CCAE"></path>
        <text id="Turquoise" font-family="HelveticaNeue-Bold, Helvetica Neue" font-size="15" font-weight="bold" fill="#565656">
            <tspan x="35.995" y="683">Turquoise</tspan>
        </text>
        <text id="#50CCAE" font-family="HelveticaNeue, Helvetica Neue" font-size="13" font-weight="normal" fill="#8A8A8A">
            <tspan x="35.177" y="702">#50CCAE</tspan>
        </text>
        <path d="M206.25,977.75 L206.25,1176.25 L27.75,1176.25 L27.75,977.75 L206.25,977.75 Z" id="border" stroke="#C8C8C8" stroke-width="1.5"></path>
        <path d="M206.25,977.75 L206.25,1106.25 L27.75,1106.25 L27.75,977.75 L206.25,977.75 Z" id="#FFFFFF" stroke="#C8C8C8" stroke-width="1.5" fill="#FCA752"></path>
        <text id="Orange" font-family="HelveticaNeue-Bold, Helvetica Neue" font-size="15" font-weight="bold" fill="#565656">
            <tspan x="35.215" y="1129">Orange</tspan>
        </text>
        <text id="#ef6b73" font-family="HelveticaNeue, Helvetica Neue" font-size="13" font-weight="normal" fill="#8A8A8A">
            <tspan x="35.55" y="1148">#ef6b73</tspan>
        </text>
        <path d="M206.25,754.75 L206.25,953.25 L27.75,953.25 L27.75,754.75 L206.25,754.75 Z" id="border" stroke="#C8C8C8" stroke-width="1.5"></path>
        <path d="M206.25,754.75 L206.25,883.25 L27.75,883.25 L27.75,754.75 L206.25,754.75 Z" id="#FFFFFF" stroke="#C8C8C8" stroke-width="1.5" fill="#BAE67E"></path>
        <text id="Green" font-family="HelveticaNeue-Bold, Helvetica Neue" font-size="15" font-weight="bold" fill="#565656">
            <tspan x="35.935" y="906">Green</tspan>
        </text>
        <text id="#bae67e" font-family="HelveticaNeue, Helvetica Neue" font-size="13" font-weight="normal" fill="#8A8A8A">
            <tspan x="35.664" y="925">#bae67e</tspan>
        </text>
        <path d="M400.25,85.75 L400.25,284.25 L221.75,284.25 L221.75,85.75 L400.25,85.75 Z" id="border" stroke="#C8C8C8" stroke-width="1.5"></path>
        <path d="M400.25,85.75 L400.25,214.25 L221.75,214.25 L221.75,85.75 L400.25,85.75 Z" id="#FFFFFF" stroke="#C8C8C8" stroke-width="1.5" fill="#0A192F"></path>
        <text id="Dark-navy" font-family="HelveticaNeue-Bold, Helvetica Neue" font-size="15" font-weight="bold" fill="#565656">
            <tspan x="229.57" y="237">Dark navy</tspan>
        </text>
        <text id="#0a192f" font-family="HelveticaNeue, Helvetica Neue" font-size="13" font-weight="normal" fill="#8A8A8A">
            <tspan x="229.031" y="256">#0a192f</tspan>
        </text>
        <path d="M400.25,308.75 L400.25,507.25 L221.75,507.25 L221.75,308.75 L400.25,308.75 Z" id="border" stroke="#C8C8C8" stroke-width="1.5"></path>
        <path d="M400.25,308.75 L400.25,437.25 L221.75,437.25 L221.75,308.75 L400.25,308.75 Z" id="#FFFFFF" stroke="#C8C8C8" stroke-width="1.5" fill="#A8B2D1"></path>
        <text id="Slate" font-family="HelveticaNeue-Bold, Helvetica Neue" font-size="15" font-weight="bold" fill="#565656">
            <tspan x="231.895" y="460">Slate</tspan>
        </text>
        <text id="#a8b2d1" font-family="HelveticaNeue, Helvetica Neue" font-size="13" font-weight="normal" fill="#8A8A8A">
            <tspan x="229.689" y="479">#a8b2d1</tspan>
        </text>
        <path d="M400.25,531.75 L400.25,730.25 L221.75,730.25 L221.75,531.75 L400.25,531.75 Z" id="border" stroke="#C8C8C8" stroke-width="1.5"></path>
        <path d="M400.25,531.75 L400.25,660.25 L221.75,660.25 L221.75,531.75 L400.25,531.75 Z" id="#FFFFFF" stroke="#C8C8C8" stroke-width="1.5" fill="#64FFDA"></path>
        <text id="Bright-turquoise" font-family="HelveticaNeue-Bold, Helvetica Neue" font-size="15" font-weight="bold" fill="#565656">
            <tspan x="231.725" y="683">Bright turquoise</tspan>
        </text>
        <text id="#64ffda" font-family="HelveticaNeue, Helvetica Neue" font-size="13" font-weight="normal" fill="#8A8A8A">
            <tspan x="231.125" y="702">#64ffda</tspan>
        </text>
        <path d="M594.25,85.75 L594.25,284.25 L415.75,284.25 L415.75,85.75 L594.25,85.75 Z" id="border" stroke="#C8C8C8" stroke-width="1.5"></path>
        <path d="M594.25,85.75 L594.25,214.25 L415.75,214.25 L415.75,85.75 L594.25,85.75 Z" id="#FFFFFF" stroke="#C8C8C8" stroke-width="1.5" fill="#233554"></path>
        <text id="Navy" font-family="HelveticaNeue-Bold, Helvetica Neue" font-size="15" font-weight="bold" fill="#565656">
            <tspan x="423.69" y="237">Navy</tspan>
        </text>
        <text id="#233554" font-family="HelveticaNeue, Helvetica Neue" font-size="13" font-weight="normal" fill="#8A8A8A">
            <tspan x="423.404" y="256">#233554</tspan>
        </text>
        <path d="M594.25,308.75 L594.25,507.25 L415.75,507.25 L415.75,308.75 L594.25,308.75 Z" id="border" stroke="#C8C8C8" stroke-width="1.5"></path>
        <path d="M788.25,308.75 L788.25,507.25 L609.75,507.25 L609.75,308.75 L788.25,308.75 Z" id="border-copy-2" stroke="#C8C8C8" stroke-width="1.5"></path>
        <path d="M594.25,308.75 L594.25,437.25 L415.75,437.25 L415.75,308.75 L594.25,308.75 Z" id="#FFFFFF" stroke="#C8C8C8" stroke-width="1.5" fill="#CCD6F6"></path>
        <path d="M788.25,308.75 L788.25,437.25 L609.75,437.25 L609.75,308.75 L788.25,308.75 Z" id="#FFFFFF-Copy-2" stroke="#C8C8C8" stroke-width="1.5" fill="#FFFFFF"></path>
        <text id="Light-slate" font-family="HelveticaNeue-Bold, Helvetica Neue" font-size="15" font-weight="bold" fill="#565656">
            <tspan x="423.3" y="460">Light slate</tspan>
        </text>
        <text id="White" font-family="HelveticaNeue-Bold, Helvetica Neue" font-size="15" font-weight="bold" fill="#565656">
            <tspan x="619.685" y="460">White</tspan>
        </text>
        <text id="#ccd6f6" font-family="HelveticaNeue, Helvetica Neue" font-size="13" font-weight="normal" fill="#8A8A8A">
            <tspan x="423.797" y="479">#ccd6f6</tspan>
        </text>
        <text id="#ffffff" font-family="HelveticaNeue, Helvetica Neue" font-size="13" font-weight="normal" fill="#8A8A8A">
            <tspan x="619.769" y="479">#ffffff</tspan>
        </text>
        <text id="Poppins-Bold-Poppins" font-family=".AppleSystemUIFont" font-size="72" font-weight="normal" line-spacing="83" fill="#565656">
            <tspan x="208.769531" y="1482">Poppins Bold</tspan>
            <tspan x="114.269531" y="1565">Poppins Regular</tspan>
        </text>
        <text id="Base:-17-px-Milli:-1" font-family=".AppleSystemUIFont" font-size="29" font-weight="normal" line-spacing="55" fill="#565656">
            <tspan x="816.998535" y="1454">Base: 17 px</tspan>
            <tspan x="827.491211" y="1509">Milli: 14 px</tspan>
        </text>
        <path d="M788.25,85.75 L788.25,284.25 L609.75,284.25 L609.75,85.75 L788.25,85.75 Z" id="border" stroke="#C8C8C8" stroke-width="1.5"></path>
        <path d="M788.25,85.75 L788.25,214.25 L609.75,214.25 L609.75,85.75 L788.25,85.75 Z" id="#FFFFFF" stroke="#C8C8C8" stroke-width="1.5" fill="#4F5D76"></path>
        <text id="Light-navy" font-family="HelveticaNeue-Bold, Helvetica Neue" font-size="15" font-weight="bold" fill="#565656">
            <tspan x="617.635" y="237">Light navy</tspan>
        </text>
        <text id="#4f5d76" font-family="HelveticaNeue, Helvetica Neue" font-size="13" font-weight="normal" fill="#8A8A8A">
            <tspan x="617.303" y="256">#4f5d76</tspan>
        </text>
    </g>
</svg>