<?xml version="1.0" encoding="UTF-8"?>
<svg viewBox="0 0 20 20" version="1.1" xmlns="http://www.w3.org/2000/svg" xmlns:xlink="http://www.w3.org/1999/xlink">
    <g fill="#CCD6F6">
        <circle cx="10" cy="18" r="2"></circle>
        <circle cx="10" cy="10" r="2"></circle>
        <circle cx="10" cy="2" r="2"></circle>
    </g>
</svg>
