<?xml version="1.0" encoding="utf-8"?>
<!-- Generator: Adobe Illustrator 26.2.1, SVG Export Plug-In . SVG Version: 6.00 Build 0)  -->
<svg version="1.1" id="Layer_1" xmlns="http://www.w3.org/2000/svg" xmlns:xlink="http://www.w3.org/1999/xlink" x="0px" y="0px"
	 viewBox="0 0 512 512" style="enable-background:new 0 0 512 512;" xml:space="preserve">
<path d="M440.7,206.7L309.4,93.4c-11.5-9.9-29.6-1.9-29.6,13.5v59.7C160.1,168,65.1,192,65.1,305.4c0,45.8,29.5,91.2,62.1,114.9
	c10.2,7.4,24.7-1.9,20.9-13.9c-33.8-108.1,16-136.8,131.7-138.5v65.5c0,15.4,18.1,23.4,29.6,13.5l131.2-113.3
	C448.9,226.6,448.9,213.8,440.7,206.7z"/>
</svg>
