<?xml version="1.0" encoding="utf-8"?>
<!-- Generator: Adobe Illustrator 26.5.0, SVG Export Plug-In . SVG Version: 6.00 Build 0)  -->
<svg version="1.1" id="Layer_1" xmlns="http://www.w3.org/2000/svg" xmlns:xlink="http://www.w3.org/1999/xlink" x="0px" y="0px"
	 viewBox="0 0 64 64" style="enable-background:new 0 0 64 64;" xml:space="preserve">
<style type="text/css">
	.st0{fill:#020C1B;}
	.st1{fill:#64FFDA;}
</style>
<g>
	<g>
		<circle class="st0" cx="32" cy="32" r="32"/>
		<path class="st1" d="M62.3,21.6c-0.5-0.1-1.1-0.1-1.6-0.1c-0.7,0-1.4,0.1-2.2,0.2c-4.3,1-7.3,4.7-7.3,9.2v5.9
			c0,2.6-2.2,4.8-4.9,4.8c-2.7,0-4.9-2.2-4.9-4.9v-5.6V31c-0.1-1.1-0.2-1.9-0.4-2.7c-1.1-4-4.8-6.8-9-6.8c-0.7,0-1.4,0.1-2.2,0.2
			c-4.3,1-7.3,4.7-7.3,9.2v5.9c0,2.6-2.2,4.8-4.8,4.8c-2.7,0-4.9-2.2-4.9-4.9v-5.6V31c-0.1-1.1-0.2-1.9-0.4-2.7
			c-1.1-4-4.8-6.8-9-6.8c-0.6,0-1.2,0.1-1.7,0.2c-0.6,1.7-1,3.5-1.3,5.4c0.5-0.4,1.2-0.7,1.9-0.9c0.4-0.1,0.8-0.1,1.2-0.1
			c2.2,0,4.1,1.5,4.6,3.5c0.1,0.4,0.2,1,0.2,1.7v5.6c0,5.2,4.2,9.4,9.4,9.4c5.1,0,9.3-4.2,9.4-9.3v-5.9c0-2.3,1.6-4.3,3.8-4.8
			c0.4-0.1,0.8-0.1,1.2-0.1c2.2,0,4.1,1.5,4.6,3.5c0.1,0.4,0.2,1,0.2,1.7v5.6c0,5.2,4.2,9.4,9.4,9.4c5.1,0,9.3-4.2,9.4-9.3v-5.9
			c0-2.3,1.6-4.3,3.8-4.8c0.4-0.1,0.8-0.1,1.2-0.1c1.1,0,2.1,0.4,3,1C63.3,25.1,62.9,23.3,62.3,21.6z"/>
	</g>
</g>
</svg>
