[
  {
    "login": "gabor-boros",
    "id": 19173947,
    "node_id": "MDQ6VXNlcjE5MTczOTQ3",
    "avatar_url": "https://avatars.githubusercontent.com/u/19173947?v=4",
    "gravatar_id": "",
    "url": "https://api.github.com/users/gabor-boros",
    "html_url": "https://github.com/gabor-boros",
    "followers_url": "https://api.github.com/users/gabor-boros/followers",
    "following_url": "https://api.github.com/users/gabor-boros/following{/other_user}",
    "gists_url": "https://api.github.com/users/gabor-boros/gists{/gist_id}",
    "starred_url": "https://api.github.com/users/gabor-boros/starred{/owner}{/repo}",
    "subscriptions_url": "https://api.github.com/users/gabor-boros/subscriptions",
    "organizations_url": "https://api.github.com/users/gabor-boros/orgs",
    "repos_url": "https://api.github.com/users/gabor-boros/repos",
    "events_url": "https://api.github.com/users/gabor-boros/events{/privacy}",
    "received_events_url": "https://api.github.com/users/gabor-boros/received_events",
    "type": "User",
    "site_admin": false
  },
  {
    "login": "open-craft-grove",
    "id": 149105119,
    "node_id": "U_kgDOCOMp3w",
    "avatar_url": "https://avatars.githubusercontent.com/u/149105119?v=4",
    "gravatar_id": "",
    "url": "https://api.github.com/users/open-craft-grove",
    "html_url": "https://github.com/open-craft-grove",
    "followers_url": "https://api.github.com/users/open-craft-grove/followers",
    "following_url": "https://api.github.com/users/open-craft-grove/following{/other_user}",
    "gists_url": "https://api.github.com/users/open-craft-grove/gists{/gist_id}",
    "starred_url": "https://api.github.com/users/open-craft-grove/starred{/owner}{/repo}",
    "subscriptions_url": "https://api.github.com/users/open-craft-grove/subscriptions",
    "organizations_url": "https://api.github.com/users/open-craft-grove/orgs",
    "repos_url": "https://api.github.com/users/open-craft-grove/repos",
    "events_url": "https://api.github.com/users/open-craft-grove/events{/privacy}",
    "received_events_url": "https://api.github.com/users/open-craft-grove/received_events",
    "type": "User",
    "site_admin": false
  }
]