<?xml version="1.0" encoding="UTF-8"?>
<!DOCTYPE svg PUBLIC "-//W3C//DTD SVG 1.1//EN" "http://www.w3.org/Graphics/SVG/1.1/DTD/svg11.dtd">
<svg version="1.2" width="230.05mm" height="36.74mm" viewBox="1000 25026 23005 3674" preserveAspectRatio="xMidYMid" fill-rule="evenodd" stroke-width="28.222" stroke-linejoin="round" xmlns="http://www.w3.org/2000/svg" xmlns:ooo="http://xml.openoffice.org/svg/export" xmlns:xlink="http://www.w3.org/1999/xlink" xmlns:presentation="http://sun.com/xmlns/staroffice/presentation" xmlns:smil="http://www.w3.org/2001/SMIL20/" xmlns:anim="urn:oasis:names:tc:opendocument:xmlns:animation:1.0" xml:space="preserve">
 <defs class="ClipPathGroup">
  <clipPath id="presentation_clip_path" clipPathUnits="userSpaceOnUse">
   <rect x="1000" y="25026" width="23005" height="3674"/>
  </clipPath>
  <clipPath id="presentation_clip_path_shrink" clipPathUnits="userSpaceOnUse">
   <rect x="1023" y="25029" width="22959" height="3667"/>
  </clipPath>
 </defs>
 <defs>
  <font id="EmbeddedFont_1" horiz-adv-x="2048">
   <font-face font-family="Liberation Mono embedded" units-per-em="2048" font-weight="normal" font-style="normal" ascent="1693" descent="609"/>
   <missing-glyph horiz-adv-x="2048" d="M 0,0 L 2047,0 2047,2047 0,2047 0,0 Z"/>
   <glyph unicode="." horiz-adv-x="266" d="M 496,0 L 496,299 731,299 731,0 496,0 Z"/>
  </font>
 </defs>
 <defs>
  <font id="EmbeddedFont_2" horiz-adv-x="2048">
   <font-face font-family="Liberation Serif embedded" units-per-em="2048" font-weight="normal" font-style="normal" ascent="1799" descent="423"/>
   <missing-glyph horiz-adv-x="2048" d="M 0,0 L 2047,0 2047,2047 0,2047 0,0 Z"/>
   <glyph unicode="2" horiz-adv-x="848" d="M 911,0 L 90,0 90,147 C 157,210 219,266 276,316 332,365 383,412 428,455 473,498 512,539 546,578 579,617 607,658 630,701 652,744 669,790 680,839 691,888 696,944 696,1006 696,1093 676,1159 637,1204 598,1249 533,1272 444,1272 424,1272 404,1271 385,1268 365,1265 346,1261 328,1256 310,1251 293,1245 278,1239 262,1232 248,1226 236,1219 L 201,1055 135,1055 135,1313 C 186,1325 236,1335 285,1344 334,1352 387,1356 444,1356 591,1356 701,1326 775,1265 848,1204 885,1117 885,1006 885,951 878,901 864,854 849,807 829,763 802,720 775,677 743,634 704,593 665,551 621,508 572,463 523,418 469,371 410,321 351,270 288,215 221,154 L 911,154 911,0 Z"/>
   <glyph unicode="1" horiz-adv-x="742" d="M 627,80 L 901,53 901,0 180,0 180,53 455,80 455,1174 184,1077 184,1130 575,1352 627,1352 627,80 Z"/>
  </font>
 </defs>
 <defs>
  <font id="EmbeddedFont_3" horiz-adv-x="2048">
   <font-face font-family="Liberation Serif embedded" units-per-em="2048" font-weight="normal" font-style="italic" ascent="1799" descent="423"/>
   <missing-glyph horiz-adv-x="2048" d="M 0,0 L 2047,0 2047,2047 0,2047 0,0 Z"/>
   <glyph unicode="z" horiz-adv-x="794" d="M -23,0 L -14,45 550,860 401,860 C 383,860 365,859 346,858 327,856 309,854 292,851 275,848 260,844 247,840 234,835 223,830 215,825 L 160,690 113,690 158,940 770,940 762,891 200,80 397,80 C 434,80 471,84 506,93 541,101 571,112 594,127 L 670,274 717,274 645,0 -23,0 Z"/>
   <glyph unicode="x" horiz-adv-x="927" d="M 248,236 C 227,215 209,197 196,182 182,167 171,153 163,142 155,130 150,119 147,110 144,101 142,92 142,84 142,73 146,65 154,59 161,53 171,48 184,45 L 176,0 -9,0 C -13,3 -17,9 -20,17 -23,24 -25,33 -25,43 -25,52 -22,63 -18,74 -12,85 -5,97 6,111 17,125 31,141 48,159 65,177 87,198 112,221 L 385,475 213,870 106,895 114,940 362,940 507,582 631,700 C 674,741 704,773 721,796 738,819 747,839 747,856 747,861 745,866 742,870 738,874 733,878 727,881 721,884 715,886 708,889 701,891 694,893 688,895 L 696,940 873,940 C 879,935 884,930 888,923 892,916 894,907 894,897 894,858 848,794 756,707 L 542,506 734,66 850,45 842,0 586,0 419,400 248,236 Z"/>
   <glyph unicode="n" horiz-adv-x="901" d="M 755,748 C 755,778 747,802 731,821 715,840 690,849 655,849 627,849 598,843 569,830 540,817 511,800 484,779 457,758 431,735 408,709 385,682 365,656 349,630 L 239,0 73,0 226,871 108,896 116,941 394,941 367,749 C 392,782 419,811 447,838 474,865 503,887 533,906 562,925 593,939 624,950 655,960 686,965 718,965 749,965 777,961 802,953 827,945 848,932 866,915 883,898 897,876 907,849 916,822 921,791 921,754 921,746 920,735 919,722 917,708 915,693 912,677 909,661 907,645 904,628 901,611 899,595 896,580 L 808,69 939,45 931,0 630,0 732,582 C 735,597 737,612 740,628 743,644 745,660 748,675 750,690 752,704 753,717 754,730 755,740 755,748 Z"/>
   <glyph unicode="Z" horiz-adv-x="1165" d="M 42,94 L 907,1255 707,1255 C 620,1255 547,1253 489,1249 431,1245 389,1240 364,1235 L 296,1024 227,1024 283,1341 1156,1341 1140,1255 267,84 507,84 C 550,84 594,85 637,88 680,90 721,93 758,97 795,100 828,104 856,108 884,111 904,114 917,117 L 1021,373 1091,373 998,0 25,0 42,94 Z"/>
   <glyph unicode="S" horiz-adv-x="1006" d="M 76,371 L 141,371 142,180 C 153,164 168,149 187,135 206,120 227,108 252,97 277,86 304,77 333,71 362,64 392,61 423,61 480,61 529,68 572,82 614,95 649,115 678,141 707,166 728,197 743,233 757,269 764,310 764,355 764,391 756,422 740,449 724,476 703,500 676,521 649,542 619,562 586,580 552,598 517,616 482,635 447,653 412,673 379,694 345,715 315,739 288,767 261,794 240,826 224,862 208,898 200,940 200,989 200,1050 211,1104 233,1150 254,1196 285,1234 326,1265 366,1295 415,1318 473,1333 530,1348 595,1356 667,1356 733,1356 792,1353 845,1346 897,1339 946,1329 991,1318 L 942,1039 877,1039 872,1210 C 851,1227 821,1242 783,1254 745,1266 701,1272 652,1272 603,1272 562,1266 527,1253 492,1240 463,1223 441,1201 418,1178 402,1152 391,1122 380,1092 375,1060 375,1025 375,992 383,963 400,938 416,913 437,890 464,870 490,849 520,830 554,813 588,795 623,777 658,758 693,739 727,719 761,698 795,677 825,652 852,625 878,598 899,566 916,531 932,495 940,453 940,406 940,340 929,281 908,228 886,175 853,131 810,94 767,57 712,29 647,10 582,-10 505,-20 417,-20 333,-20 258,-11 191,6 124,23 68,45 24,73 L 76,371 Z"/>
   <glyph unicode="R" horiz-adv-x="1244" d="M 444,588 L 354,80 533,53 523,0 -11,0 -1,53 161,80 370,1262 202,1288 212,1341 744,1341 C 822,1341 889,1333 946,1318 1002,1303 1048,1281 1085,1253 1122,1224 1149,1190 1167,1150 1184,1110 1193,1065 1193,1016 1193,961 1185,911 1170,868 1154,824 1131,786 1101,753 1071,720 1034,693 991,670 948,647 898,629 843,616 L 1070,80 1217,53 1207,0 899,0 653,588 444,588 Z M 616,678 C 675,678 729,685 776,700 823,714 862,735 895,763 927,791 952,826 969,867 986,908 995,956 995,1010 995,1091 971,1151 923,1191 875,1231 804,1251 709,1251 L 561,1251 460,678 616,678 Z"/>
   <glyph unicode="N" horiz-adv-x="1482" d="M 1170,1262 L 994,1288 1004,1341 1461,1341 1451,1288 1275,1262 1052,0 955,0 474,1206 275,80 451,53 441,0 -15,0 -5,53 170,80 379,1262 211,1288 221,1341 609,1341 1008,336 1170,1262 Z"/>
   <glyph unicode="M" horiz-adv-x="1826" d="M 721,0 L 686,0 455,1153 266,80 442,53 432,0 -24,0 -14,53 161,80 370,1262 202,1288 212,1341 594,1341 800,318 1398,1341 1800,1341 1790,1288 1614,1262 1405,80 1573,53 1563,0 1019,0 1029,53 1213,80 1402,1153 721,0 Z"/>
  </font>
 </defs>
 <defs>
  <font id="EmbeddedFont_4" horiz-adv-x="2048">
   <font-face font-family="OpenSymbol embedded" units-per-em="2048" font-weight="normal" font-style="normal" ascent="1402" descent="423"/>
   <missing-glyph horiz-adv-x="2048" d="M 0,0 L 2047,0 2047,2047 0,2047 0,0 Z"/>
   <glyph unicode="≫" horiz-adv-x="1853" d="M 885,0 L 885,111 1845,594 885,1073 885,1184 2068,592 885,0 Z M 223,0 L 223,111 1184,594 223,1073 223,1184 1407,592 223,0 Z"/>
   <glyph unicode="−" horiz-adv-x="1191" d="M 221,543 L 221,641 1405,641 1405,543 221,543 Z"/>
   <glyph unicode="↑" horiz-adv-x="1191" d="M 1339,807 L 1200,657 850,975 C 857,951 860,933 860,922 L 860,51 655,51 651,585 651,582 651,838 C 651,893 656,939 666,975 L 315,657 174,807 758,1333 1339,807 Z"/>
   <glyph unicode="]" horiz-adv-x="398" d="M 428,-403 L 74,-403 74,-330 330,-330 330,1553 74,1553 74,1622 428,1622 428,-403 Z"/>
   <glyph unicode="[" horiz-adv-x="372" d="M 150,-403 L 150,1622 504,1622 504,1552 248,1552 248,-332 504,-332 504,-403 150,-403 Z"/>
   <glyph unicode="+" horiz-adv-x="980" d="M 512,115 L 512,516 115,516 115,684 512,684 512,1083 682,1083 682,684 1081,684 1081,516 682,516 682,115 512,115 Z"/>
  </font>
 </defs>
 <defs class="TextShapeIndex">
  <g ooo:slide="id1" ooo:id-list="id3 id4 id5 id6 id7 id8 id9 id10 id11 id12 id13 id14 id15 id16 id17 id18 id19 id20 id21 id22 id23 id24 id25 id26 id27 id28 id29 id30 id31 id32 id33 id34 id35 id36 id37 id38 id39 id40 id41 id42 id43 id44 id45 id46 id47 id48 id49 id50 id51 id52 id53 id54 id55 id56 id57 id58 id59 id60 id61 id62 id63 id64 id65 id66 id67 id68 id69 id70 id71 id72 id73 id74 id75 id76 id77 id78 id79 id80"/>
 </defs>
 <defs class="EmbeddedBulletChars">
  <g id="bullet-char-template(57356)" transform="scale(0.00048828125,-0.00048828125)">
   <path d="M 580,1141 L 1163,571 580,0 -4,571 580,1141 Z"/>
  </g>
  <g id="bullet-char-template(57354)" transform="scale(0.00048828125,-0.00048828125)">
   <path d="M 8,1128 L 1137,1128 1137,0 8,0 8,1128 Z"/>
  </g>
  <g id="bullet-char-template(10146)" transform="scale(0.00048828125,-0.00048828125)">
   <path d="M 174,0 L 602,739 174,1481 1456,739 174,0 Z M 1358,739 L 309,1346 659,739 1358,739 Z"/>
  </g>
  <g id="bullet-char-template(10132)" transform="scale(0.00048828125,-0.00048828125)">
   <path d="M 2015,739 L 1276,0 717,0 1260,543 174,543 174,936 1260,936 717,1481 1274,1481 2015,739 Z"/>
  </g>
  <g id="bullet-char-template(10007)" transform="scale(0.00048828125,-0.00048828125)">
   <path d="M 0,-2 C -7,14 -16,27 -25,37 L 356,567 C 262,823 215,952 215,954 215,979 228,992 255,992 264,992 276,990 289,987 310,991 331,999 354,1012 L 381,999 492,748 772,1049 836,1024 860,1049 C 881,1039 901,1025 922,1006 886,937 835,863 770,784 769,783 710,716 594,584 L 774,223 C 774,196 753,168 711,139 L 727,119 C 717,90 699,76 672,76 641,76 570,178 457,381 L 164,-76 C 142,-110 111,-127 72,-127 30,-127 9,-110 8,-76 1,-67 -2,-52 -2,-32 -2,-23 -1,-13 0,-2 Z"/>
  </g>
  <g id="bullet-char-template(10004)" transform="scale(0.00048828125,-0.00048828125)">
   <path d="M 285,-33 C 182,-33 111,30 74,156 52,228 41,333 41,471 41,549 55,616 82,672 116,743 169,778 240,778 293,778 328,747 346,684 L 369,508 C 377,444 397,411 428,410 L 1163,1116 C 1174,1127 1196,1133 1229,1133 1271,1133 1292,1118 1292,1087 L 1292,965 C 1292,929 1282,901 1262,881 L 442,47 C 390,-6 338,-33 285,-33 Z"/>
  </g>
  <g id="bullet-char-template(9679)" transform="scale(0.00048828125,-0.00048828125)">
   <path d="M 813,0 C 632,0 489,54 383,161 276,268 223,411 223,592 223,773 276,916 383,1023 489,1130 632,1184 813,1184 992,1184 1136,1130 1245,1023 1353,916 1407,772 1407,592 1407,412 1353,268 1245,161 1136,54 992,0 813,0 Z"/>
  </g>
  <g id="bullet-char-template(8226)" transform="scale(0.00048828125,-0.00048828125)">
   <path d="M 346,457 C 273,457 209,483 155,535 101,586 74,649 74,723 74,796 101,859 155,911 209,963 273,989 346,989 419,989 480,963 531,910 582,859 608,796 608,723 608,648 583,586 532,535 482,483 420,457 346,457 Z"/>
  </g>
  <g id="bullet-char-template(8211)" transform="scale(0.00048828125,-0.00048828125)">
   <path d="M -4,459 L 1135,459 1135,606 -4,606 -4,459 Z"/>
  </g>
  <g id="bullet-char-template(61548)" transform="scale(0.00048828125,-0.00048828125)">
   <path d="M 173,740 C 173,903 231,1043 346,1159 462,1274 601,1332 765,1332 928,1332 1067,1274 1183,1159 1299,1043 1357,903 1357,740 1357,577 1299,437 1183,322 1067,206 928,148 765,148 601,148 462,206 346,322 231,437 173,577 173,740 Z"/>
  </g>
 </defs>
 <defs class="TextEmbeddedBitmaps"/>
 <g class="SlideGroup">
  <g>
   <g id="container-id1">
    <g id="id1" class="Slide" clip-path="url(#presentation_clip_path)">
     <g class="Page">
      <g class="OLE2">
       <g id="id3">
        <rect class="BoundingBox" stroke="none" fill="none" x="1000" y="25367" width="992" height="481"/>
        <defs>
         <clipPath id="clip_path_1" clipPathUnits="userSpaceOnUse">
          <path d="M 1005,25374 L 1984,25374 1984,25850 1005,25850 1005,25374 Z"/>
         </clipPath>
        </defs>
        <g clip-path="url(#clip_path_1)">
         <text class="TextShape"><tspan class="TextParagraph" font-family="Liberation Serif, serif" font-size="422px" font-style="italic" font-weight="400"><tspan class="TextPosition" x="1132" y="25737"><tspan fill="rgb(0,0,0)" stroke="none">x</tspan></tspan></tspan></text>
         <text class="TextShape"><tspan class="TextParagraph" font-family="OpenSymbol" font-size="422px" font-weight="400"><tspan class="TextPosition" x="1370" y="25737"><tspan fill="rgb(0,0,0)" stroke="none">[</tspan></tspan></tspan></text>
         <text class="TextShape"><tspan class="TextParagraph" font-family="Liberation Serif, serif" font-size="422px" font-style="italic" font-weight="400"><tspan class="TextPosition" x="1529" y="25737"><tspan fill="rgb(0,0,0)" stroke="none">n</tspan></tspan></tspan></text>
         <text class="TextShape"><tspan class="TextParagraph" font-family="OpenSymbol" font-size="422px" font-weight="400"><tspan class="TextPosition" x="1767" y="25737"><tspan fill="rgb(0,0,0)" stroke="none">]</tspan></tspan></tspan></text>
        </g>
       </g>
      </g>
      <g class="Group">
       <g class="com.sun.star.drawing.LineShape">
        <g id="id4">
         <rect class="BoundingBox" stroke="none" fill="none" x="13847" y="25384" width="1219" height="353"/>
         <path fill="none" stroke="rgb(0,0,0)" stroke-width="35" stroke-linejoin="round" d="M 13865,25560 L 14560,25560"/>
         <path fill="rgb(0,0,0)" stroke="none" d="M 15065,25560 L 14537,25384 14537,25736 15065,25560 Z"/>
        </g>
       </g>
       <g class="com.sun.star.drawing.CustomShape">
        <g id="id5">
         <rect class="BoundingBox" stroke="none" fill="none" x="12973" y="25113" width="842" height="842"/>
         <path fill="none" stroke="rgb(0,0,0)" stroke-width="40" stroke-linejoin="round" d="M 13393,25133 C 13620,25133 13793,25306 13793,25533 13793,25760 13620,25933 13393,25933 13166,25933 12993,25760 12993,25533 12993,25306 13166,25133 13393,25133 Z"/>
        </g>
       </g>
       <g class="OLE2">
        <g id="id6">
         <rect class="BoundingBox" stroke="none" fill="none" x="13176" y="25444" width="491" height="234"/>
         <defs>
          <clipPath id="clip_path_2" clipPathUnits="userSpaceOnUse">
           <path d="M 13176,25453 L 13679,25453 13679,25665 13176,25665 13176,25453 Z"/>
          </clipPath>
         </defs>
         <g clip-path="url(#clip_path_2)">
          <text class="TextShape"><tspan class="TextParagraph" font-family="OpenSymbol" font-size="422px" font-weight="400"><tspan class="TextPosition" x="13282" y="25682"><tspan fill="rgb(0,0,0)" stroke="none">+</tspan></tspan></tspan></text>
         </g>
        </g>
       </g>
       <g class="com.sun.star.drawing.LineShape">
        <g id="id7">
         <rect class="BoundingBox" stroke="none" fill="none" x="13217" y="25997" width="353" height="948"/>
         <path fill="none" stroke="rgb(0,0,0)" stroke-width="35" stroke-linejoin="round" d="M 13393,26926 L 13393,26502"/>
         <path fill="rgb(0,0,0)" stroke="none" d="M 13393,25997 L 13217,26525 13569,26525 13393,25997 Z"/>
        </g>
       </g>
       <g class="Group">
        <g class="com.sun.star.drawing.CustomShape">
         <g id="id8">
          <rect class="BoundingBox" stroke="none" fill="none" x="13681" y="26440" width="1041" height="1041"/>
          <path fill="none" stroke="rgb(0,0,0)" stroke-width="40" stroke-linejoin="round" d="M 14201,27460 L 13701,27460 13701,26460 14701,26460 14701,27460 14201,27460 Z"/>
         </g>
        </g>
        <g class="OLE2">
         <g id="id9">
          <rect class="BoundingBox" stroke="none" fill="none" x="13795" y="26698" width="813" height="525"/>
          <defs>
           <clipPath id="clip_path_3" clipPathUnits="userSpaceOnUse">
            <path d="M 13785,26696 L 14605,26696 14605,27226 13785,27226 13785,26696 Z"/>
           </clipPath>
          </defs>
          <g clip-path="url(#clip_path_3)">
           <text class="TextShape"><tspan class="TextParagraph" font-family="Liberation Serif, serif" font-size="422px" font-style="italic" font-weight="400"><tspan class="TextPosition" x="13902" y="27121"><tspan fill="rgb(0,0,0)" stroke="none">Z</tspan></tspan></tspan></text>
           <text class="TextShape"><tspan class="TextParagraph" font-family="OpenSymbol" font-size="253px" font-weight="400"><tspan class="TextPosition" x="14168" y="26936"><tspan fill="rgb(0,0,0)" stroke="none">−</tspan></tspan></tspan></text>
           <text class="TextShape"><tspan class="TextParagraph" font-family="Liberation Serif, serif" font-size="253px" font-weight="400"><tspan class="TextPosition" x="14383" y="26936"><tspan fill="rgb(0,0,0)" stroke="none">1</tspan></tspan></tspan></text>
          </g>
         </g>
        </g>
       </g>
       <g class="com.sun.star.drawing.LineShape">
        <g id="id10">
         <rect class="BoundingBox" stroke="none" fill="none" x="14030" y="25390" width="353" height="1047"/>
         <path fill="none" stroke="rgb(0,0,0)" stroke-width="35" stroke-linejoin="round" d="M 14206,26418 L 14206,25719"/>
         <path fill="rgb(0,0,0)" stroke="none" d="M 14174,25738 L 14142,25729 14110,25713 14081,25691 14059,25662 14043,25630 14034,25598 14030,25566 14034,25534 14043,25501 14059,25469 14081,25441 14110,25419 14142,25403 14174,25393 14207,25390 14238,25393 14271,25403 14302,25419 14331,25441 14353,25469 14369,25501 14378,25534 14382,25566 14378,25598 14369,25630 14353,25662 14331,25691 14302,25713 14271,25729 14238,25738 14207,25742 14174,25738 Z"/>
        </g>
       </g>
       <g class="com.sun.star.drawing.LineShape">
        <g id="id11">
         <rect class="BoundingBox" stroke="none" fill="none" x="13366" y="26903" width="285" height="41"/>
         <path fill="none" stroke="rgb(0,0,0)" stroke-width="40" stroke-linejoin="round" d="M 13386,26923 L 13630,26923"/>
        </g>
       </g>
      </g>
      <g class="com.sun.star.drawing.CustomShape">
       <g id="id12">
        <rect class="BoundingBox" stroke="none" fill="none" x="10923" y="25026" width="1041" height="1041"/>
        <path fill="none" stroke="rgb(0,0,0)" stroke-width="40" stroke-linejoin="round" d="M 11443,26046 L 10943,26046 10943,25046 11943,25046 11943,26046 11443,26046 Z"/>
       </g>
      </g>
      <g class="OLE2">
       <g id="id13">
        <rect class="BoundingBox" stroke="none" fill="none" x="11018" y="25313" width="851" height="467"/>
        <defs>
         <clipPath id="clip_path_4" clipPathUnits="userSpaceOnUse">
          <path d="M 11006,25321 L 11880,25321 11880,25770 11006,25770 11006,25321 Z"/>
         </clipPath>
        </defs>
        <g clip-path="url(#clip_path_4)">
         <text class="TextShape"><tspan class="TextParagraph" font-family="Liberation Serif, serif" font-size="422px" font-style="italic" font-weight="400"><tspan class="TextPosition" x="11151" y="25683"><tspan fill="rgb(0,0,0)" stroke="none">R</tspan></tspan></tspan></text>
         <text class="TextShape"><tspan class="TextParagraph" font-family="OpenSymbol" font-size="422px" font-weight="400"><tspan class="TextPosition" x="11445" y="25683"><tspan fill="rgb(0,0,0)" stroke="none">↑</tspan></tspan></tspan></text>
        </g>
       </g>
      </g>
      <g class="com.sun.star.drawing.TextShape">
       <g id="id14">
        <rect class="BoundingBox" stroke="none" fill="none" x="16952" y="25203" width="1202" height="688"/>
        <text class="TextShape"><tspan class="TextParagraph" font-family="Liberation Mono, monospace" font-size="388px" font-weight="400"><tspan class="TextPosition" x="17202" y="25650"><tspan fill="rgb(0,0,0)" stroke="none">...</tspan></tspan></tspan></text>
       </g>
      </g>
      <g class="com.sun.star.drawing.TextShape">
       <g id="id15">
        <rect class="BoundingBox" stroke="none" fill="none" x="6869" y="25203" width="1202" height="688"/>
        <text class="TextShape"><tspan class="TextParagraph" font-family="Liberation Mono, monospace" font-size="388px" font-weight="400"><tspan class="TextPosition" x="7119" y="25650"><tspan fill="rgb(0,0,0)" stroke="none">...</tspan></tspan></tspan></text>
       </g>
      </g>
      <g class="com.sun.star.drawing.LineShape">
       <g id="id16">
        <rect class="BoundingBox" stroke="none" fill="none" x="17923" y="25370" width="919" height="353"/>
        <path fill="none" stroke="rgb(0,0,0)" stroke-width="35" stroke-linejoin="round" d="M 17941,25546 L 18336,25546"/>
        <path fill="rgb(0,0,0)" stroke="none" d="M 18841,25546 L 18313,25370 18313,25722 18841,25546 Z"/>
       </g>
      </g>
      <g class="Group">
       <g class="com.sun.star.drawing.LineShape">
        <g id="id17">
         <rect class="BoundingBox" stroke="none" fill="none" x="16002" y="25384" width="1219" height="353"/>
         <path fill="none" stroke="rgb(0,0,0)" stroke-width="35" stroke-linejoin="round" d="M 16020,25560 L 16715,25560"/>
         <path fill="rgb(0,0,0)" stroke="none" d="M 17220,25560 L 16692,25384 16692,25736 17220,25560 Z"/>
        </g>
       </g>
       <g class="com.sun.star.drawing.CustomShape">
        <g id="id18">
         <rect class="BoundingBox" stroke="none" fill="none" x="15128" y="25113" width="842" height="842"/>
         <path fill="none" stroke="rgb(0,0,0)" stroke-width="40" stroke-linejoin="round" d="M 15548,25133 C 15775,25133 15948,25306 15948,25533 15948,25760 15775,25933 15548,25933 15321,25933 15148,25760 15148,25533 15148,25306 15321,25133 15548,25133 Z"/>
        </g>
       </g>
       <g class="OLE2">
        <g id="id19">
         <rect class="BoundingBox" stroke="none" fill="none" x="15331" y="25444" width="491" height="234"/>
         <defs>
          <clipPath id="clip_path_5" clipPathUnits="userSpaceOnUse">
           <path d="M 15319,25453 L 15822,25453 15822,25665 15319,25665 15319,25453 Z"/>
          </clipPath>
         </defs>
         <g clip-path="url(#clip_path_5)">
          <text class="TextShape"><tspan class="TextParagraph" font-family="OpenSymbol" font-size="422px" font-weight="400"><tspan class="TextPosition" x="15437" y="25682"><tspan fill="rgb(0,0,0)" stroke="none">+</tspan></tspan></tspan></text>
         </g>
        </g>
       </g>
       <g class="com.sun.star.drawing.LineShape">
        <g id="id20">
         <rect class="BoundingBox" stroke="none" fill="none" x="15372" y="25997" width="353" height="948"/>
         <path fill="none" stroke="rgb(0,0,0)" stroke-width="35" stroke-linejoin="round" d="M 15548,26926 L 15548,26502"/>
         <path fill="rgb(0,0,0)" stroke="none" d="M 15548,25997 L 15372,26525 15724,26525 15548,25997 Z"/>
        </g>
       </g>
       <g class="Group">
        <g class="com.sun.star.drawing.CustomShape">
         <g id="id21">
          <rect class="BoundingBox" stroke="none" fill="none" x="15836" y="26440" width="1041" height="1041"/>
          <path fill="none" stroke="rgb(0,0,0)" stroke-width="40" stroke-linejoin="round" d="M 16356,27460 L 15856,27460 15856,26460 16856,26460 16856,27460 16356,27460 Z"/>
         </g>
        </g>
        <g class="OLE2">
         <g id="id22">
          <rect class="BoundingBox" stroke="none" fill="none" x="15950" y="26698" width="813" height="525"/>
          <defs>
           <clipPath id="clip_path_6" clipPathUnits="userSpaceOnUse">
            <path d="M 15954,26696 L 16775,26696 16775,27226 15954,27226 15954,26696 Z"/>
           </clipPath>
          </defs>
          <g clip-path="url(#clip_path_6)">
           <text class="TextShape"><tspan class="TextParagraph" font-family="Liberation Serif, serif" font-size="422px" font-style="italic" font-weight="400"><tspan class="TextPosition" x="16057" y="27121"><tspan fill="rgb(0,0,0)" stroke="none">Z</tspan></tspan></tspan></text>
           <text class="TextShape"><tspan class="TextParagraph" font-family="OpenSymbol" font-size="253px" font-weight="400"><tspan class="TextPosition" x="16324" y="26936"><tspan fill="rgb(0,0,0)" stroke="none">−</tspan></tspan></tspan></text>
           <text class="TextShape"><tspan class="TextParagraph" font-family="Liberation Serif, serif" font-size="253px" font-weight="400"><tspan class="TextPosition" x="16538" y="26936"><tspan fill="rgb(0,0,0)" stroke="none">1</tspan></tspan></tspan></text>
          </g>
         </g>
        </g>
       </g>
       <g class="com.sun.star.drawing.LineShape">
        <g id="id23">
         <rect class="BoundingBox" stroke="none" fill="none" x="16185" y="25390" width="353" height="1047"/>
         <path fill="none" stroke="rgb(0,0,0)" stroke-width="35" stroke-linejoin="round" d="M 16361,26418 L 16361,25719"/>
         <path fill="rgb(0,0,0)" stroke="none" d="M 16329,25738 L 16297,25729 16265,25713 16236,25691 16214,25662 16198,25630 16189,25598 16185,25566 16189,25534 16198,25501 16214,25469 16236,25441 16265,25419 16297,25403 16329,25393 16362,25390 16393,25393 16426,25403 16457,25419 16486,25441 16508,25469 16524,25501 16533,25534 16537,25566 16533,25598 16524,25630 16508,25662 16486,25691 16457,25713 16426,25729 16393,25738 16362,25742 16329,25738 Z"/>
        </g>
       </g>
       <g class="com.sun.star.drawing.LineShape">
        <g id="id24">
         <rect class="BoundingBox" stroke="none" fill="none" x="15521" y="26903" width="285" height="41"/>
         <path fill="none" stroke="rgb(0,0,0)" stroke-width="40" stroke-linejoin="round" d="M 15541,26923 L 15785,26923"/>
        </g>
       </g>
      </g>
      <g class="Group">
       <g class="com.sun.star.drawing.LineShape">
        <g id="id25">
         <rect class="BoundingBox" stroke="none" fill="none" x="19782" y="25384" width="1219" height="353"/>
         <path fill="none" stroke="rgb(0,0,0)" stroke-width="35" stroke-linejoin="round" d="M 19800,25560 L 20495,25560"/>
         <path fill="rgb(0,0,0)" stroke="none" d="M 21000,25560 L 20472,25384 20472,25736 21000,25560 Z"/>
        </g>
       </g>
       <g class="com.sun.star.drawing.CustomShape">
        <g id="id26">
         <rect class="BoundingBox" stroke="none" fill="none" x="18908" y="25113" width="842" height="842"/>
         <path fill="none" stroke="rgb(0,0,0)" stroke-width="40" stroke-linejoin="round" d="M 19328,25133 C 19555,25133 19728,25306 19728,25533 19728,25760 19555,25933 19328,25933 19101,25933 18928,25760 18928,25533 18928,25306 19101,25133 19328,25133 Z"/>
        </g>
       </g>
       <g class="OLE2">
        <g id="id27">
         <rect class="BoundingBox" stroke="none" fill="none" x="19111" y="25444" width="491" height="234"/>
         <defs>
          <clipPath id="clip_path_7" clipPathUnits="userSpaceOnUse">
           <path d="M 19103,25453 L 19606,25453 19606,25665 19103,25665 19103,25453 Z"/>
          </clipPath>
         </defs>
         <g clip-path="url(#clip_path_7)">
          <text class="TextShape"><tspan class="TextParagraph" font-family="OpenSymbol" font-size="422px" font-weight="400"><tspan class="TextPosition" x="19217" y="25682"><tspan fill="rgb(0,0,0)" stroke="none">+</tspan></tspan></tspan></text>
         </g>
        </g>
       </g>
       <g class="com.sun.star.drawing.LineShape">
        <g id="id28">
         <rect class="BoundingBox" stroke="none" fill="none" x="19152" y="25997" width="353" height="948"/>
         <path fill="none" stroke="rgb(0,0,0)" stroke-width="35" stroke-linejoin="round" d="M 19328,26926 L 19328,26502"/>
         <path fill="rgb(0,0,0)" stroke="none" d="M 19328,25997 L 19152,26525 19504,26525 19328,25997 Z"/>
        </g>
       </g>
       <g class="Group">
        <g class="com.sun.star.drawing.CustomShape">
         <g id="id29">
          <rect class="BoundingBox" stroke="none" fill="none" x="19616" y="26440" width="1041" height="1041"/>
          <path fill="none" stroke="rgb(0,0,0)" stroke-width="40" stroke-linejoin="round" d="M 20136,27460 L 19636,27460 19636,26460 20636,26460 20636,27460 20136,27460 Z"/>
         </g>
        </g>
        <g class="OLE2">
         <g id="id30">
          <rect class="BoundingBox" stroke="none" fill="none" x="19730" y="26698" width="813" height="525"/>
          <defs>
           <clipPath id="clip_path_8" clipPathUnits="userSpaceOnUse">
            <path d="M 19738,26696 L 20532,26696 20532,27226 19738,27226 19738,26696 Z"/>
           </clipPath>
          </defs>
          <g clip-path="url(#clip_path_8)">
           <text class="TextShape"><tspan class="TextParagraph" font-family="Liberation Serif, serif" font-size="422px" font-style="italic" font-weight="400"><tspan class="TextPosition" x="19837" y="27121"><tspan fill="rgb(0,0,0)" stroke="none">Z</tspan></tspan></tspan></text>
           <text class="TextShape"><tspan class="TextParagraph" font-family="OpenSymbol" font-size="253px" font-weight="400"><tspan class="TextPosition" x="20104" y="26936"><tspan fill="rgb(0,0,0)" stroke="none">−</tspan></tspan></tspan></text>
           <text class="TextShape"><tspan class="TextParagraph" font-family="Liberation Serif, serif" font-size="253px" font-weight="400"><tspan class="TextPosition" x="20318" y="26936"><tspan fill="rgb(0,0,0)" stroke="none">1</tspan></tspan></tspan></text>
          </g>
         </g>
        </g>
       </g>
       <g class="com.sun.star.drawing.LineShape">
        <g id="id31">
         <rect class="BoundingBox" stroke="none" fill="none" x="19965" y="25390" width="353" height="1047"/>
         <path fill="none" stroke="rgb(0,0,0)" stroke-width="35" stroke-linejoin="round" d="M 20141,26418 L 20141,25719"/>
         <path fill="rgb(0,0,0)" stroke="none" d="M 20109,25738 L 20077,25729 20045,25713 20016,25691 19994,25662 19978,25630 19969,25598 19965,25566 19969,25534 19978,25501 19994,25469 20016,25441 20045,25419 20077,25403 20109,25393 20142,25390 20173,25393 20206,25403 20237,25419 20266,25441 20288,25469 20304,25501 20313,25534 20317,25566 20313,25598 20304,25630 20288,25662 20266,25691 20237,25713 20206,25729 20173,25738 20142,25742 20109,25738 Z"/>
        </g>
       </g>
       <g class="com.sun.star.drawing.LineShape">
        <g id="id32">
         <rect class="BoundingBox" stroke="none" fill="none" x="19301" y="26903" width="285" height="41"/>
         <path fill="none" stroke="rgb(0,0,0)" stroke-width="40" stroke-linejoin="round" d="M 19321,26923 L 19565,26923"/>
        </g>
       </g>
      </g>
      <g class="Group">
       <g class="com.sun.star.drawing.LineShape">
        <g id="id33">
         <rect class="BoundingBox" stroke="none" fill="none" x="1929" y="25421" width="1219" height="353"/>
         <path fill="none" stroke="rgb(0,0,0)" stroke-width="35" stroke-linejoin="round" d="M 1947,25597 L 2642,25597"/>
         <path fill="rgb(0,0,0)" stroke="none" d="M 3147,25597 L 2619,25421 2619,25773 3147,25597 Z"/>
        </g>
       </g>
       <g class="com.sun.star.drawing.CustomShape">
        <g id="id34">
         <rect class="BoundingBox" stroke="none" fill="none" x="3198" y="25150" width="842" height="843"/>
         <path fill="none" stroke="rgb(0,0,0)" stroke-width="40" stroke-linejoin="round" d="M 3619,25170 C 3392,25170 3219,25343 3219,25570 3219,25797 3392,25970 3619,25970 3846,25970 4019,25797 4019,25570 4019,25343 3846,25170 3619,25170 Z"/>
        </g>
       </g>
       <g class="OLE2">
        <g id="id35">
         <rect class="BoundingBox" stroke="none" fill="none" x="3346" y="25481" width="491" height="234"/>
         <defs>
          <clipPath id="clip_path_9" clipPathUnits="userSpaceOnUse">
           <path d="M 3334,25479 L 3836,25479 3836,25718 3334,25718 3334,25479 Z"/>
          </clipPath>
         </defs>
         <g clip-path="url(#clip_path_9)">
          <text class="TextShape"><tspan class="TextParagraph" font-family="OpenSymbol" font-size="422px" font-weight="400"><tspan class="TextPosition" x="3452" y="25719"><tspan fill="rgb(0,0,0)" stroke="none">+</tspan></tspan></tspan></text>
         </g>
        </g>
       </g>
       <g class="com.sun.star.drawing.LineShape">
        <g id="id36">
         <rect class="BoundingBox" stroke="none" fill="none" x="3443" y="26034" width="353" height="948"/>
         <path fill="none" stroke="rgb(0,0,0)" stroke-width="35" stroke-linejoin="round" d="M 3619,26963 L 3619,26539"/>
         <path fill="rgb(0,0,0)" stroke="none" d="M 3619,26034 L 3443,26562 3795,26562 3619,26034 Z"/>
        </g>
       </g>
       <g class="Group">
        <g class="com.sun.star.drawing.CustomShape">
         <g id="id37">
          <rect class="BoundingBox" stroke="none" fill="none" x="1791" y="26477" width="1041" height="1041"/>
          <path fill="none" stroke="rgb(0,0,0)" stroke-width="40" stroke-linejoin="round" d="M 2311,27497 L 1811,27497 1811,26497 2811,26497 2811,27497 2311,27497 Z"/>
         </g>
        </g>
        <g class="OLE2">
         <g id="id38">
          <rect class="BoundingBox" stroke="none" fill="none" x="1905" y="26735" width="940" height="525"/>
          <defs>
           <clipPath id="clip_path_10" clipPathUnits="userSpaceOnUse">
            <path d="M 1905,26723 L 2831,26723 2831,27252 1905,27252 1905,26723 Z"/>
           </clipPath>
          </defs>
          <g clip-path="url(#clip_path_10)">
           <text class="TextShape"><tspan class="TextParagraph" font-family="Liberation Serif, serif" font-size="422px" font-style="italic" font-weight="400"><tspan class="TextPosition" x="2012" y="27158"><tspan fill="rgb(0,0,0)" stroke="none">Z</tspan></tspan></tspan></text>
           <text class="TextShape"><tspan class="TextParagraph" font-family="OpenSymbol" font-size="253px" font-weight="400"><tspan class="TextPosition" x="2279" y="26973"><tspan fill="rgb(0,0,0)" stroke="none">−</tspan></tspan></tspan></text>
           <text class="TextShape"><tspan class="TextParagraph" font-family="Liberation Serif, serif" font-size="253px" font-style="italic" font-weight="400"><tspan class="TextPosition" x="2493" y="26973"><tspan fill="rgb(0,0,0)" stroke="none">M</tspan></tspan></tspan></text>
          </g>
         </g>
        </g>
       </g>
       <g class="com.sun.star.drawing.LineShape">
        <g id="id39">
         <rect class="BoundingBox" stroke="none" fill="none" x="2130" y="25427" width="353" height="1047"/>
         <path fill="none" stroke="rgb(0,0,0)" stroke-width="35" stroke-linejoin="round" d="M 2306,26455 L 2306,25756"/>
         <path fill="rgb(0,0,0)" stroke="none" d="M 2274,25775 L 2242,25766 2210,25750 2181,25728 2159,25699 2143,25667 2134,25635 2130,25603 2134,25571 2143,25538 2159,25506 2181,25478 2210,25456 2242,25440 2274,25430 2307,25427 2338,25430 2371,25440 2402,25456 2431,25478 2453,25506 2469,25538 2478,25571 2482,25603 2478,25635 2469,25667 2453,25699 2431,25728 2402,25750 2371,25766 2338,25775 2307,25779 2274,25775 Z"/>
        </g>
       </g>
       <g class="com.sun.star.drawing.LineShape">
        <g id="id40">
         <rect class="BoundingBox" stroke="none" fill="none" x="2871" y="26940" width="776" height="41"/>
         <path fill="none" stroke="rgb(0,0,0)" stroke-width="40" stroke-linejoin="round" d="M 3626,26960 L 2891,26960"/>
        </g>
       </g>
      </g>
      <g class="Group">
       <g class="com.sun.star.drawing.LineShape">
        <g id="id41">
         <rect class="BoundingBox" stroke="none" fill="none" x="4083" y="25421" width="1219" height="353"/>
         <path fill="none" stroke="rgb(0,0,0)" stroke-width="35" stroke-linejoin="round" d="M 4101,25597 L 4796,25597"/>
         <path fill="rgb(0,0,0)" stroke="none" d="M 5301,25597 L 4773,25421 4773,25773 5301,25597 Z"/>
        </g>
       </g>
       <g class="com.sun.star.drawing.CustomShape">
        <g id="id42">
         <rect class="BoundingBox" stroke="none" fill="none" x="5352" y="25150" width="842" height="843"/>
         <path fill="none" stroke="rgb(0,0,0)" stroke-width="40" stroke-linejoin="round" d="M 5773,25170 C 5546,25170 5373,25343 5373,25570 5373,25797 5546,25970 5773,25970 6000,25970 6173,25797 6173,25570 6173,25343 6000,25170 5773,25170 Z"/>
        </g>
       </g>
       <g class="OLE2">
        <g id="id43">
         <rect class="BoundingBox" stroke="none" fill="none" x="5500" y="25481" width="491" height="234"/>
         <defs>
          <clipPath id="clip_path_11" clipPathUnits="userSpaceOnUse">
           <path d="M 5503,25479 L 5980,25479 5980,25718 5503,25718 5503,25479 Z"/>
          </clipPath>
         </defs>
         <g clip-path="url(#clip_path_11)">
          <text class="TextShape"><tspan class="TextParagraph" font-family="OpenSymbol" font-size="422px" font-weight="400"><tspan class="TextPosition" x="5606" y="25719"><tspan fill="rgb(0,0,0)" stroke="none">+</tspan></tspan></tspan></text>
         </g>
        </g>
       </g>
       <g class="com.sun.star.drawing.LineShape">
        <g id="id44">
         <rect class="BoundingBox" stroke="none" fill="none" x="5597" y="26034" width="353" height="948"/>
         <path fill="none" stroke="rgb(0,0,0)" stroke-width="35" stroke-linejoin="round" d="M 5773,26963 L 5773,26539"/>
         <path fill="rgb(0,0,0)" stroke="none" d="M 5773,26034 L 5597,26562 5949,26562 5773,26034 Z"/>
        </g>
       </g>
       <g class="Group">
        <g class="com.sun.star.drawing.CustomShape">
         <g id="id45">
          <rect class="BoundingBox" stroke="none" fill="none" x="3945" y="26477" width="1041" height="1041"/>
          <path fill="none" stroke="rgb(0,0,0)" stroke-width="40" stroke-linejoin="round" d="M 4465,27497 L 3965,27497 3965,26497 4965,26497 4965,27497 4465,27497 Z"/>
         </g>
        </g>
        <g class="OLE2">
         <g id="id46">
          <rect class="BoundingBox" stroke="none" fill="none" x="4059" y="26735" width="940" height="525"/>
          <defs>
           <clipPath id="clip_path_12" clipPathUnits="userSpaceOnUse">
            <path d="M 4048,26723 L 5001,26723 5001,27252 4048,27252 4048,26723 Z"/>
           </clipPath>
          </defs>
          <g clip-path="url(#clip_path_12)">
           <text class="TextShape"><tspan class="TextParagraph" font-family="Liberation Serif, serif" font-size="422px" font-style="italic" font-weight="400"><tspan class="TextPosition" x="4166" y="27158"><tspan fill="rgb(0,0,0)" stroke="none">Z</tspan></tspan></tspan></text>
           <text class="TextShape"><tspan class="TextParagraph" font-family="OpenSymbol" font-size="253px" font-weight="400"><tspan class="TextPosition" x="4432" y="26973"><tspan fill="rgb(0,0,0)" stroke="none">−</tspan></tspan></tspan></text>
           <text class="TextShape"><tspan class="TextParagraph" font-family="Liberation Serif, serif" font-size="253px" font-style="italic" font-weight="400"><tspan class="TextPosition" x="4646" y="26973"><tspan fill="rgb(0,0,0)" stroke="none">M</tspan></tspan></tspan></text>
          </g>
         </g>
        </g>
       </g>
       <g class="com.sun.star.drawing.LineShape">
        <g id="id47">
         <rect class="BoundingBox" stroke="none" fill="none" x="4284" y="25427" width="353" height="1047"/>
         <path fill="none" stroke="rgb(0,0,0)" stroke-width="35" stroke-linejoin="round" d="M 4460,26455 L 4460,25756"/>
         <path fill="rgb(0,0,0)" stroke="none" d="M 4428,25775 L 4396,25766 4364,25750 4335,25728 4313,25699 4297,25667 4288,25635 4284,25603 4288,25571 4297,25538 4313,25506 4335,25478 4364,25456 4396,25440 4428,25430 4461,25427 4492,25430 4525,25440 4556,25456 4585,25478 4607,25506 4623,25538 4632,25571 4636,25603 4632,25635 4623,25667 4607,25699 4585,25728 4556,25750 4525,25766 4492,25775 4461,25779 4428,25775 Z"/>
        </g>
       </g>
       <g class="com.sun.star.drawing.LineShape">
        <g id="id48">
         <rect class="BoundingBox" stroke="none" fill="none" x="5025" y="26940" width="776" height="41"/>
         <path fill="none" stroke="rgb(0,0,0)" stroke-width="40" stroke-linejoin="round" d="M 5780,26960 L 5045,26960"/>
        </g>
       </g>
      </g>
      <g class="com.sun.star.drawing.LineShape">
       <g id="id49">
        <rect class="BoundingBox" stroke="none" fill="none" x="6196" y="25407" width="919" height="353"/>
        <path fill="none" stroke="rgb(0,0,0)" stroke-width="35" stroke-linejoin="round" d="M 6214,25583 L 6609,25583"/>
        <path fill="rgb(0,0,0)" stroke="none" d="M 7114,25583 L 6586,25407 6586,25759 7114,25583 Z"/>
       </g>
      </g>
      <g class="Group">
       <g class="com.sun.star.drawing.LineShape">
        <g id="id50">
         <rect class="BoundingBox" stroke="none" fill="none" x="7825" y="25421" width="1219" height="353"/>
         <path fill="none" stroke="rgb(0,0,0)" stroke-width="35" stroke-linejoin="round" d="M 7843,25597 L 8538,25597"/>
         <path fill="rgb(0,0,0)" stroke="none" d="M 9043,25597 L 8515,25421 8515,25773 9043,25597 Z"/>
        </g>
       </g>
       <g class="com.sun.star.drawing.CustomShape">
        <g id="id51">
         <rect class="BoundingBox" stroke="none" fill="none" x="9094" y="25150" width="842" height="843"/>
         <path fill="none" stroke="rgb(0,0,0)" stroke-width="40" stroke-linejoin="round" d="M 9515,25170 C 9288,25170 9115,25343 9115,25570 9115,25797 9288,25970 9515,25970 9742,25970 9915,25797 9915,25570 9915,25343 9742,25170 9515,25170 Z"/>
        </g>
       </g>
       <g class="OLE2">
        <g id="id52">
         <rect class="BoundingBox" stroke="none" fill="none" x="9242" y="25481" width="491" height="234"/>
         <defs>
          <clipPath id="clip_path_13" clipPathUnits="userSpaceOnUse">
           <path d="M 9234,25479 L 9737,25479 9737,25718 9234,25718 9234,25479 Z"/>
          </clipPath>
         </defs>
         <g clip-path="url(#clip_path_13)">
          <text class="TextShape"><tspan class="TextParagraph" font-family="OpenSymbol" font-size="422px" font-weight="400"><tspan class="TextPosition" x="9348" y="25719"><tspan fill="rgb(0,0,0)" stroke="none">+</tspan></tspan></tspan></text>
         </g>
        </g>
       </g>
       <g class="com.sun.star.drawing.LineShape">
        <g id="id53">
         <rect class="BoundingBox" stroke="none" fill="none" x="9339" y="26034" width="353" height="948"/>
         <path fill="none" stroke="rgb(0,0,0)" stroke-width="35" stroke-linejoin="round" d="M 9515,26963 L 9515,26539"/>
         <path fill="rgb(0,0,0)" stroke="none" d="M 9515,26034 L 9339,26562 9691,26562 9515,26034 Z"/>
        </g>
       </g>
       <g class="Group">
        <g class="com.sun.star.drawing.CustomShape">
         <g id="id54">
          <rect class="BoundingBox" stroke="none" fill="none" x="7687" y="26477" width="1041" height="1041"/>
          <path fill="none" stroke="rgb(0,0,0)" stroke-width="40" stroke-linejoin="round" d="M 8207,27497 L 7707,27497 7707,26497 8707,26497 8707,27497 8207,27497 Z"/>
         </g>
        </g>
        <g class="OLE2">
         <g id="id55">
          <rect class="BoundingBox" stroke="none" fill="none" x="7801" y="26735" width="940" height="525"/>
          <defs>
           <clipPath id="clip_path_14" clipPathUnits="userSpaceOnUse">
            <path d="M 7805,26723 L 8732,26723 8732,27252 7805,27252 7805,26723 Z"/>
           </clipPath>
          </defs>
          <g clip-path="url(#clip_path_14)">
           <text class="TextShape"><tspan class="TextParagraph" font-family="Liberation Serif, serif" font-size="422px" font-style="italic" font-weight="400"><tspan class="TextPosition" x="7908" y="27158"><tspan fill="rgb(0,0,0)" stroke="none">Z</tspan></tspan></tspan></text>
           <text class="TextShape"><tspan class="TextParagraph" font-family="OpenSymbol" font-size="253px" font-weight="400"><tspan class="TextPosition" x="8174" y="26973"><tspan fill="rgb(0,0,0)" stroke="none">−</tspan></tspan></tspan></text>
           <text class="TextShape"><tspan class="TextParagraph" font-family="Liberation Serif, serif" font-size="253px" font-style="italic" font-weight="400"><tspan class="TextPosition" x="8388" y="26973"><tspan fill="rgb(0,0,0)" stroke="none">M</tspan></tspan></tspan></text>
          </g>
         </g>
        </g>
       </g>
       <g class="com.sun.star.drawing.LineShape">
        <g id="id56">
         <rect class="BoundingBox" stroke="none" fill="none" x="8026" y="25427" width="353" height="1047"/>
         <path fill="none" stroke="rgb(0,0,0)" stroke-width="35" stroke-linejoin="round" d="M 8202,26455 L 8202,25756"/>
         <path fill="rgb(0,0,0)" stroke="none" d="M 8170,25775 L 8138,25766 8106,25750 8077,25728 8055,25699 8039,25667 8030,25635 8026,25603 8030,25571 8039,25538 8055,25506 8077,25478 8106,25456 8138,25440 8170,25430 8203,25427 8234,25430 8267,25440 8298,25456 8327,25478 8349,25506 8365,25538 8374,25571 8378,25603 8374,25635 8365,25667 8349,25699 8327,25728 8298,25750 8267,25766 8234,25775 8203,25779 8170,25775 Z"/>
        </g>
       </g>
       <g class="com.sun.star.drawing.LineShape">
        <g id="id57">
         <rect class="BoundingBox" stroke="none" fill="none" x="8767" y="26940" width="776" height="41"/>
         <path fill="none" stroke="rgb(0,0,0)" stroke-width="40" stroke-linejoin="round" d="M 9522,26960 L 8787,26960"/>
        </g>
       </g>
      </g>
      <g class="com.sun.star.drawing.LineShape">
       <g id="id58">
        <rect class="BoundingBox" stroke="none" fill="none" x="9994" y="25370" width="919" height="353"/>
        <path fill="none" stroke="rgb(0,0,0)" stroke-width="35" stroke-linejoin="round" d="M 10012,25546 L 10407,25546"/>
        <path fill="rgb(0,0,0)" stroke="none" d="M 10912,25546 L 10384,25370 10384,25722 10912,25546 Z"/>
       </g>
      </g>
      <g class="com.sun.star.drawing.CustomShape">
       <g id="id59">
        <rect class="BoundingBox" stroke="none" fill="none" x="13275" y="27608" width="1591" height="592"/>
        <path fill="none" stroke="rgb(0,0,0)" stroke-width="40" stroke-linejoin="round" d="M 13295,27628 C 13295,27766 13359,27904 13424,27904 L 13940,27904 C 14005,27904 14070,28042 14070,28179 14070,28042 14134,27904 14199,27904 L 14715,27904 C 14780,27904 14845,27766 14845,27628"/>
        <path fill="none" stroke="rgb(0,0,0)" stroke-width="40" stroke-linejoin="round" d="M 13295,28179 L 13295,28179 Z"/>
        <path fill="none" stroke="rgb(0,0,0)" stroke-width="40" stroke-linejoin="round" d="M 14845,27628 L 14845,27628 Z"/>
       </g>
      </g>
      <g class="com.sun.star.drawing.CustomShape">
       <g id="id60">
        <rect class="BoundingBox" stroke="none" fill="none" x="15429" y="27608" width="1592" height="592"/>
        <path fill="none" stroke="rgb(0,0,0)" stroke-width="40" stroke-linejoin="round" d="M 15450,27628 C 15450,27766 15514,27904 15579,27904 L 16095,27904 C 16160,27904 16225,28042 16225,28179 16225,28042 16289,27904 16354,27904 L 16870,27904 C 16935,27904 17000,27766 17000,27628"/>
        <path fill="none" stroke="rgb(0,0,0)" stroke-width="40" stroke-linejoin="round" d="M 15450,28179 L 15450,28179 Z"/>
        <path fill="none" stroke="rgb(0,0,0)" stroke-width="40" stroke-linejoin="round" d="M 17000,27628 L 17000,27628 Z"/>
       </g>
      </g>
      <g class="com.sun.star.drawing.CustomShape">
       <g id="id61">
        <rect class="BoundingBox" stroke="none" fill="none" x="19172" y="27608" width="1591" height="592"/>
        <path fill="none" stroke="rgb(0,0,0)" stroke-width="40" stroke-linejoin="round" d="M 19192,27628 C 19192,27766 19256,27904 19321,27904 L 19837,27904 C 19902,27904 19967,28042 19967,28179 19967,28042 20031,27904 20096,27904 L 20612,27904 C 20677,27904 20742,27766 20742,27628"/>
        <path fill="none" stroke="rgb(0,0,0)" stroke-width="40" stroke-linejoin="round" d="M 19192,28179 L 19192,28179 Z"/>
        <path fill="none" stroke="rgb(0,0,0)" stroke-width="40" stroke-linejoin="round" d="M 20742,27628 L 20742,27628 Z"/>
       </g>
      </g>
      <g class="com.sun.star.drawing.CustomShape">
       <g id="id62">
        <rect class="BoundingBox" stroke="none" fill="none" x="1681" y="27608" width="2195" height="592"/>
        <path fill="none" stroke="rgb(0,0,0)" stroke-width="40" stroke-linejoin="round" d="M 1701,27628 C 1701,27766 1790,27904 1880,27904 L 2598,27904 C 2688,27904 2778,28042 2778,28179 2778,28042 2867,27904 2957,27904 L 3675,27904 C 3765,27904 3855,27766 3855,27628"/>
        <path fill="none" stroke="rgb(0,0,0)" stroke-width="40" stroke-linejoin="round" d="M 1701,28179 L 1701,28179 Z"/>
        <path fill="none" stroke="rgb(0,0,0)" stroke-width="40" stroke-linejoin="round" d="M 3855,27628 L 3855,27628 Z"/>
       </g>
      </g>
      <g class="com.sun.star.drawing.CustomShape">
       <g id="id63">
        <rect class="BoundingBox" stroke="none" fill="none" x="3930" y="27608" width="2195" height="592"/>
        <path fill="none" stroke="rgb(0,0,0)" stroke-width="40" stroke-linejoin="round" d="M 3950,27628 C 3950,27766 4039,27904 4129,27904 L 4847,27904 C 4937,27904 5027,28042 5027,28179 5027,28042 5116,27904 5206,27904 L 5924,27904 C 6014,27904 6104,27766 6104,27628"/>
        <path fill="none" stroke="rgb(0,0,0)" stroke-width="40" stroke-linejoin="round" d="M 3950,28179 L 3950,28179 Z"/>
        <path fill="none" stroke="rgb(0,0,0)" stroke-width="40" stroke-linejoin="round" d="M 6104,27628 L 6104,27628 Z"/>
       </g>
      </g>
      <g class="com.sun.star.drawing.CustomShape">
       <g id="id64">
        <rect class="BoundingBox" stroke="none" fill="none" x="7560" y="27608" width="2195" height="592"/>
        <path fill="none" stroke="rgb(0,0,0)" stroke-width="40" stroke-linejoin="round" d="M 7580,27628 C 7580,27766 7669,27904 7759,27904 L 8477,27904 C 8567,27904 8657,28042 8657,28179 8657,28042 8746,27904 8836,27904 L 9554,27904 C 9644,27904 9734,27766 9734,27628"/>
        <path fill="none" stroke="rgb(0,0,0)" stroke-width="40" stroke-linejoin="round" d="M 7580,28179 L 7580,28179 Z"/>
        <path fill="none" stroke="rgb(0,0,0)" stroke-width="40" stroke-linejoin="round" d="M 9734,27628 L 9734,27628 Z"/>
       </g>
      </g>
      <g class="OLE2">
       <g id="id65">
        <rect class="BoundingBox" stroke="none" fill="none" x="13865" y="28234" width="412" height="467"/>
        <defs>
         <clipPath id="clip_path_15" clipPathUnits="userSpaceOnUse">
          <path d="M 13864,28231 L 14288,28231 14288,28707 13864,28707 13864,28231 Z"/>
         </clipPath>
        </defs>
        <g clip-path="url(#clip_path_15)">
         <text class="TextShape"><tspan class="TextParagraph" font-family="Liberation Serif, serif" font-size="422px" font-weight="400"><tspan class="TextPosition" x="13971" y="28604"><tspan fill="rgb(0,0,0)" stroke="none">1</tspan></tspan></tspan></text>
        </g>
       </g>
      </g>
      <g class="OLE2">
       <g id="id66">
        <rect class="BoundingBox" stroke="none" fill="none" x="16020" y="28234" width="412" height="467"/>
        <defs>
         <clipPath id="clip_path_16" clipPathUnits="userSpaceOnUse">
          <path d="M 16008,28231 L 16431,28231 16431,28707 16008,28707 16008,28231 Z"/>
         </clipPath>
        </defs>
        <g clip-path="url(#clip_path_16)">
         <text class="TextShape"><tspan class="TextParagraph" font-family="Liberation Serif, serif" font-size="422px" font-weight="400"><tspan class="TextPosition" x="16124" y="28604"><tspan fill="rgb(0,0,0)" stroke="none">2</tspan></tspan></tspan></text>
        </g>
       </g>
      </g>
      <g class="OLE2">
       <g id="id67">
        <rect class="BoundingBox" stroke="none" fill="none" x="19695" y="28234" width="545" height="467"/>
        <defs>
         <clipPath id="clip_path_17" clipPathUnits="userSpaceOnUse">
          <path d="M 19685,28231 L 20241,28231 20241,28707 19685,28707 19685,28231 Z"/>
         </clipPath>
        </defs>
        <g clip-path="url(#clip_path_17)">
         <text class="TextShape"><tspan class="TextParagraph" font-family="Liberation Serif, serif" font-size="422px" font-style="italic" font-weight="400"><tspan class="TextPosition" x="19825" y="28604"><tspan fill="rgb(0,0,0)" stroke="none">N</tspan></tspan></tspan></text>
        </g>
       </g>
      </g>
      <g class="OLE2">
       <g id="id68">
        <rect class="BoundingBox" stroke="none" fill="none" x="2573" y="28234" width="412" height="467"/>
        <defs>
         <clipPath id="clip_path_18" clipPathUnits="userSpaceOnUse">
          <path d="M 2566,28231 L 2990,28231 2990,28707 2566,28707 2566,28231 Z"/>
         </clipPath>
        </defs>
        <g clip-path="url(#clip_path_18)">
         <text class="TextShape"><tspan class="TextParagraph" font-family="Liberation Serif, serif" font-size="422px" font-weight="400"><tspan class="TextPosition" x="2679" y="28604"><tspan fill="rgb(0,0,0)" stroke="none">1</tspan></tspan></tspan></text>
        </g>
       </g>
      </g>
      <g class="OLE2">
       <g id="id69">
        <rect class="BoundingBox" stroke="none" fill="none" x="4822" y="28234" width="412" height="467"/>
        <defs>
         <clipPath id="clip_path_19" clipPathUnits="userSpaceOnUse">
          <path d="M 4816,28231 L 5238,28231 5238,28707 4816,28707 4816,28231 Z"/>
         </clipPath>
        </defs>
        <g clip-path="url(#clip_path_19)">
         <text class="TextShape"><tspan class="TextParagraph" font-family="Liberation Serif, serif" font-size="422px" font-weight="400"><tspan class="TextPosition" x="4927" y="28604"><tspan fill="rgb(0,0,0)" stroke="none">2</tspan></tspan></tspan></text>
        </g>
       </g>
      </g>
      <g class="OLE2">
       <g id="id70">
        <rect class="BoundingBox" stroke="none" fill="none" x="8385" y="28234" width="545" height="467"/>
        <defs>
         <clipPath id="clip_path_20" clipPathUnits="userSpaceOnUse">
          <path d="M 8387,28231 L 8916,28231 8916,28707 8387,28707 8387,28231 Z"/>
         </clipPath>
        </defs>
        <g clip-path="url(#clip_path_20)">
         <text class="TextShape"><tspan class="TextParagraph" font-family="Liberation Serif, serif" font-size="422px" font-style="italic" font-weight="400"><tspan class="TextPosition" x="8516" y="28604"><tspan fill="rgb(0,0,0)" stroke="none">N</tspan></tspan></tspan></text>
        </g>
       </g>
      </g>
      <g class="com.sun.star.drawing.TextShape">
       <g id="id71">
        <rect class="BoundingBox" stroke="none" fill="none" x="17575" y="28010" width="1202" height="688"/>
        <text class="TextShape"><tspan class="TextParagraph" font-family="Liberation Mono, monospace" font-size="388px" font-weight="400"><tspan class="TextPosition" x="17825" y="28457"><tspan fill="rgb(0,0,0)" stroke="none">...</tspan></tspan></tspan></text>
       </g>
      </g>
      <g class="com.sun.star.drawing.TextShape">
       <g id="id72">
        <rect class="BoundingBox" stroke="none" fill="none" x="6208" y="28010" width="1202" height="688"/>
        <text class="TextShape"><tspan class="TextParagraph" font-family="Liberation Mono, monospace" font-size="388px" font-weight="400"><tspan class="TextPosition" x="6458" y="28457"><tspan fill="rgb(0,0,0)" stroke="none">...</tspan></tspan></tspan></text>
       </g>
      </g>
      <g class="com.sun.star.drawing.CustomShape">
       <g id="id73">
        <rect class="BoundingBox" stroke="none" fill="none" x="21108" y="25026" width="1041" height="1041"/>
        <path fill="none" stroke="rgb(0,0,0)" stroke-width="40" stroke-linejoin="round" d="M 21628,26046 L 21128,26046 21128,25046 22128,25046 22128,26046 21628,26046 Z"/>
       </g>
      </g>
      <g class="OLE2">
       <g id="id74">
        <rect class="BoundingBox" stroke="none" fill="none" x="21118" y="25290" width="1021" height="467"/>
        <defs>
         <clipPath id="clip_path_21" clipPathUnits="userSpaceOnUse">
          <path d="M 21114,25294 L 22146,25294 22146,25744 21114,25744 21114,25294 Z"/>
         </clipPath>
        </defs>
        <g clip-path="url(#clip_path_21)">
         <text class="TextShape"><tspan class="TextParagraph" font-family="OpenSymbol" font-size="422px" font-weight="400"><tspan class="TextPosition" x="21278" y="25660"><tspan fill="rgb(0,0,0)" stroke="none">≫</tspan></tspan></tspan></text>
         <text class="TextShape"><tspan class="TextParagraph" font-family="Liberation Serif, serif" font-size="422px" font-style="italic" font-weight="400"><tspan class="TextPosition" x="21813" y="25660"><tspan fill="rgb(0,0,0)" stroke="none">S</tspan></tspan></tspan></text>
        </g>
       </g>
      </g>
      <g class="OLE2">
       <g id="id75">
        <rect class="BoundingBox" stroke="none" fill="none" x="23039" y="25287" width="967" height="481"/>
        <defs>
         <clipPath id="clip_path_22" clipPathUnits="userSpaceOnUse">
          <path d="M 23045,25294 L 23998,25294 23998,25770 23045,25770 23045,25294 Z"/>
         </clipPath>
        </defs>
        <g clip-path="url(#clip_path_22)">
         <text class="TextShape"><tspan class="TextParagraph" font-family="Liberation Serif, serif" font-size="422px" font-style="italic" font-weight="400"><tspan class="TextPosition" x="23171" y="25657"><tspan fill="rgb(0,0,0)" stroke="none">z</tspan></tspan></tspan></text>
         <text class="TextShape"><tspan class="TextParagraph" font-family="OpenSymbol" font-size="422px" font-weight="400"><tspan class="TextPosition" x="23383" y="25657"><tspan fill="rgb(0,0,0)" stroke="none">[</tspan></tspan></tspan></text>
         <text class="TextShape"><tspan class="TextParagraph" font-family="Liberation Serif, serif" font-size="422px" font-style="italic" font-weight="400"><tspan class="TextPosition" x="23542" y="25657"><tspan fill="rgb(0,0,0)" stroke="none">n</tspan></tspan></tspan></text>
         <text class="TextShape"><tspan class="TextParagraph" font-family="OpenSymbol" font-size="422px" font-weight="400"><tspan class="TextPosition" x="23780" y="25657"><tspan fill="rgb(0,0,0)" stroke="none">]</tspan></tspan></tspan></text>
        </g>
       </g>
      </g>
      <g class="com.sun.star.drawing.LineShape">
       <g id="id76">
        <rect class="BoundingBox" stroke="none" fill="none" x="22212" y="25351" width="919" height="353"/>
        <path fill="none" stroke="rgb(0,0,0)" stroke-width="35" stroke-linejoin="round" d="M 22230,25527 L 22625,25527"/>
        <path fill="rgb(0,0,0)" stroke="none" d="M 23130,25527 L 22602,25351 22602,25703 23130,25527 Z"/>
       </g>
      </g>
      <g class="OLE2">
       <g id="id77">
        <rect class="BoundingBox" stroke="none" fill="none" x="3099" y="26714" width="547" height="61"/>
        <defs>
         <clipPath id="clip_path_23" clipPathUnits="userSpaceOnUse">
          <path d="M 3096,26723 L 3651,26723 3651,26776 3096,26776 3096,26723 Z"/>
         </clipPath>
        </defs>
        <g clip-path="url(#clip_path_23)">
         <text class="TextShape"><tspan class="TextParagraph" font-family="OpenSymbol" font-size="422px" font-weight="400"><tspan class="TextPosition" x="3205" y="26873"><tspan fill="rgb(0,0,0)" stroke="none">−</tspan></tspan></tspan></text>
        </g>
       </g>
      </g>
      <g class="OLE2">
       <g id="id78">
        <rect class="BoundingBox" stroke="none" fill="none" x="5269" y="26714" width="547" height="61"/>
        <defs>
         <clipPath id="clip_path_24" clipPathUnits="userSpaceOnUse">
          <path d="M 5265,26723 L 5821,26723 5821,26776 5265,26776 5265,26723 Z"/>
         </clipPath>
        </defs>
        <g clip-path="url(#clip_path_24)">
         <text class="TextShape"><tspan class="TextParagraph" font-family="OpenSymbol" font-size="422px" font-weight="400"><tspan class="TextPosition" x="5375" y="26873"><tspan fill="rgb(0,0,0)" stroke="none">−</tspan></tspan></tspan></text>
        </g>
       </g>
      </g>
      <g class="OLE2">
       <g id="id79">
        <rect class="BoundingBox" stroke="none" fill="none" x="9015" y="26714" width="547" height="61"/>
        <defs>
         <clipPath id="clip_path_25" clipPathUnits="userSpaceOnUse">
          <path d="M 9022,26723 L 9551,26723 9551,26776 9022,26776 9022,26723 Z"/>
         </clipPath>
        </defs>
        <g clip-path="url(#clip_path_25)">
         <text class="TextShape"><tspan class="TextParagraph" font-family="OpenSymbol" font-size="422px" font-weight="400"><tspan class="TextPosition" x="9121" y="26873"><tspan fill="rgb(0,0,0)" stroke="none">−</tspan></tspan></tspan></text>
        </g>
       </g>
      </g>
      <g class="com.sun.star.drawing.LineShape">
       <g id="id80">
        <rect class="BoundingBox" stroke="none" fill="none" x="12017" y="25367" width="919" height="353"/>
        <path fill="none" stroke="rgb(0,0,0)" stroke-width="35" stroke-linejoin="round" d="M 12035,25543 L 12430,25543"/>
        <path fill="rgb(0,0,0)" stroke="none" d="M 12935,25543 L 12407,25367 12407,25719 12935,25543 Z"/>
       </g>
      </g>
     </g>
    </g>
   </g>
  </g>
 </g>
</svg>