<mxfile host="Electron" modified="2024-05-15T08:03:07.952Z" agent="Mozilla/5.0 (X11; Linux x86_64) AppleWebKit/537.36 (KHTML, like Gecko) draw.io/24.4.0 Chrome/120.0.6099.109 Electron/28.1.0 Safari/537.36" etag="BueEPRyGQAtVgtGsDGdH" version="24.4.0" type="device">
  <diagram name="Page-1" id="CjPJGNU_rqgse9TX_v2h">
    <mxGraphModel dx="2924" dy="1157" grid="1" gridSize="10" guides="1" tooltips="1" connect="1" arrows="1" fold="1" page="1" pageScale="1" pageWidth="850" pageHeight="1100" math="0" shadow="0">
      <root>
        <mxCell id="0" />
        <mxCell id="1" parent="0" />
        <mxCell id="zz8Rm9DBc4B4Trq5Pj2T-1" value="drc" style="rounded=0;whiteSpace=wrap;html=1;verticalAlign=top;strokeWidth=2;fontStyle=1" parent="1" vertex="1">
          <mxGeometry x="480" y="280" width="330" height="680" as="geometry" />
        </mxCell>
        <mxCell id="zz8Rm9DBc4B4Trq5Pj2T-4" value="configurations[0].description=first&lt;br style=&quot;font-size: 10px;&quot;&gt;configurations[0].channels[0].rx=true&lt;br style=&quot;font-size: 10px;&quot;&gt;configurations[0].channels[0].tuning_freq_MHz=390.95&lt;br style=&quot;font-size: 10px;&quot;&gt;configurations[0].channels[0].bandwidth_3dB_MHz=135&lt;br style=&quot;font-size: 10px;&quot;&gt;configurations[0].channels[0].sampling_rate_Msps=90&lt;br style=&quot;font-size: 10px;&quot;&gt;configurations[0].channels[0].samples_are_complex=true&lt;br style=&quot;font-size: 10px;&quot;&gt;configurations[0].channels[0].gain_mode=manual&lt;br style=&quot;font-size: 10px;&quot;&gt;configurations[0].channels[0].gain_dB=0&lt;br style=&quot;font-size: 10px;&quot;&gt;configurations[0].channels[0].tolerance_tuning_freq_MHz=0.01&lt;div&gt;configurations[0].channels[0].tolerance_bandwidth_3dB_MHz=90&lt;br style=&quot;font-size: 10px;&quot;&gt;configurations[0].channels[0].tolerance_sampling_rate_MHz=0.01&lt;br style=&quot;font-size: 10px;&quot;&gt;configurations[0].channels[0].tolerance_gain_dB=1&lt;br style=&quot;font-size: 10px;&quot;&gt;configurations[0].&lt;b&gt;channels[0].rf_port_name=J18&lt;/b&gt;&lt;/div&gt;&lt;div&gt;configurations[0].channels[0].app_port_num 1&lt;b&gt;&lt;br&gt;&lt;/b&gt;configurations[0].channels[1].rx=true&lt;br style=&quot;border-color: var(--border-color);&quot;&gt;configurations[0].channels[1].tuning_freq_MHz=390.95&lt;br style=&quot;border-color: var(--border-color);&quot;&gt;configurations[0].channels[1].bandwidth_3dB_MHz=135&lt;br style=&quot;border-color: var(--border-color);&quot;&gt;configurations[0].channels[1].sampling_rate_Msps=90&lt;br style=&quot;border-color: var(--border-color);&quot;&gt;configurations[0].channels[1].samples_are_complex=true&lt;br style=&quot;border-color: var(--border-color);&quot;&gt;configurations[0].channels[1].gain_mode=manual&lt;br style=&quot;border-color: var(--border-color);&quot;&gt;configurations[0].channels[1].gain_dB=0&lt;br style=&quot;border-color: var(--border-color);&quot;&gt;configurations[0].channels[1].tolerance_tuning_freq_MHz=0.01&lt;/div&gt;&lt;div&gt;configurations[0].channels[1].tolerance_bandwidth_3dB_MHz=90&lt;br style=&quot;border-color: var(--border-color);&quot;&gt;configurations[0].channels[1].tolerance_sampling_rate_MHz=0.01&lt;br style=&quot;border-color: var(--border-color);&quot;&gt;configurations[0].channels[1].tolerance_gain_dB=1&lt;br style=&quot;border-color: var(--border-color);&quot;&gt;configurations[0].&lt;b&gt;channels[1].rf_port_name=J20&lt;/b&gt;&lt;/div&gt;&lt;div&gt;configurations[0].channels[1].app_port_num 0&lt;b&gt;&lt;br&gt;&lt;/b&gt;configurations[0].channels[2].rx=false&lt;br style=&quot;border-color: var(--border-color);&quot;&gt;configurations[0].channels[2].tuning_freq_MHz=390.95&lt;br style=&quot;border-color: var(--border-color);&quot;&gt;configurations[0].channels[2].bandwidth_3dB_MHz=135&lt;br style=&quot;border-color: var(--border-color);&quot;&gt;configurations[0].channels[2].sampling_rate_Msps=90&lt;br style=&quot;border-color: var(--border-color);&quot;&gt;configurations[0].channels[2].samples_are_complex=true&lt;br style=&quot;border-color: var(--border-color);&quot;&gt;configurations[0].channels[2].gain_mode=manual&lt;br style=&quot;border-color: var(--border-color);&quot;&gt;configurations[0].channels[2].gain_dB=0&lt;br style=&quot;border-color: var(--border-color);&quot;&gt;configurations[0].channels[2].tolerance_tuning_freq_MHz=0.01&lt;/div&gt;&lt;div&gt;configurations[0].channels[2].tolerance_bandwidth_3dB_MHz=90&lt;br style=&quot;border-color: var(--border-color);&quot;&gt;configurations[0].channels[2].tolerance_sampling_rate_MHz=0.01&lt;br style=&quot;border-color: var(--border-color);&quot;&gt;configurations[0].channels[2].tolerance_gain_dB=1&lt;br style=&quot;border-color: var(--border-color);&quot;&gt;configurations[0].&lt;b&gt;channels[2].rf_port_name=J3&lt;/b&gt;&lt;/div&gt;&lt;div&gt;configurations[0].channels[2].app_port_num 1&lt;b&gt;&lt;br&gt;&lt;/b&gt;configurations[0].channels[3].rx=false&lt;br style=&quot;border-color: var(--border-color);&quot;&gt;configurations[0].channels[3].tuning_freq_MHz=390.95&lt;br style=&quot;border-color: var(--border-color);&quot;&gt;configurations[0].channels[3].bandwidth_3dB_MHz=135&lt;br style=&quot;border-color: var(--border-color);&quot;&gt;configurations[0].channels[3].sampling_rate_Msps=90&lt;br style=&quot;border-color: var(--border-color);&quot;&gt;configurations[0].channels[3].samples_are_complex=true&lt;br style=&quot;border-color: var(--border-color);&quot;&gt;configurations[0].channels[3].gain_mode=manual&lt;br style=&quot;border-color: var(--border-color);&quot;&gt;configurations[0].channels[3].gain_dB=0&lt;br style=&quot;border-color: var(--border-color);&quot;&gt;configurations[0].channels[3].tolerance_tuning_freq_MHz=0.01&lt;/div&gt;&lt;div&gt;configurations[0].channels[3].tolerance_bandwidth_3dB_MHz=90&lt;br style=&quot;border-color: var(--border-color);&quot;&gt;configurations[0].channels[3].tolerance_sampling_rate_MHz=0.01&lt;br style=&quot;border-color: var(--border-color);&quot;&gt;configurations[0].channels[3].tolerance_gain_dB=1&lt;br style=&quot;border-color: var(--border-color);&quot;&gt;configurations[0].&lt;b&gt;channels[3].rf_port_name=J13&lt;/b&gt;&lt;/div&gt;&lt;div&gt;configurations[0].channels[3].app_port_num 0&lt;b&gt;&lt;br style=&quot;font-size: 10px;&quot;&gt;&lt;/b&gt;start=0&lt;/div&gt;" style="text;html=1;strokeColor=none;fillColor=none;align=left;verticalAlign=middle;whiteSpace=wrap;rounded=0;fontColor=#3399FF;fontSize=10;" parent="1" vertex="1">
          <mxGeometry x="490" y="300" width="320" height="660" as="geometry" />
        </mxCell>
        <mxCell id="zz8Rm9DBc4B4Trq5Pj2T-9" value="tx[0]" style="rounded=0;whiteSpace=wrap;html=1;verticalAlign=middle;strokeWidth=2;fontStyle=1;fontColor=#3399FF;" parent="1" vertex="1">
          <mxGeometry x="440" y="680" width="40" height="40" as="geometry" />
        </mxCell>
        <mxCell id="zz8Rm9DBc4B4Trq5Pj2T-10" value="tx[1]" style="rounded=0;whiteSpace=wrap;html=1;verticalAlign=middle;strokeWidth=2;fontStyle=1;fontColor=#3399FF;" parent="1" vertex="1">
          <mxGeometry x="440" y="800" width="40" height="40" as="geometry" />
        </mxCell>
        <mxCell id="zz8Rm9DBc4B4Trq5Pj2T-11" value="rx[0]" style="rounded=0;whiteSpace=wrap;html=1;verticalAlign=middle;strokeWidth=2;fontStyle=1;fontColor=#3399FF;" parent="1" vertex="1">
          <mxGeometry x="440" y="360" width="40" height="40" as="geometry" />
        </mxCell>
        <mxCell id="20Lr0uqHoCz4GIKEG1yG-1" value="fs_div_4_generator_csts" style="rounded=0;whiteSpace=wrap;html=1;verticalAlign=top;strokeWidth=2;fontStyle=1" parent="1" vertex="1">
          <mxGeometry x="240" y="660" width="160" height="80" as="geometry" />
        </mxCell>
        <mxCell id="20Lr0uqHoCz4GIKEG1yG-2" value="freq_is_positive=false" style="text;html=1;strokeColor=none;fillColor=none;align=left;verticalAlign=middle;whiteSpace=wrap;rounded=0;fontColor=#3399FF;fontSize=10;" parent="1" vertex="1">
          <mxGeometry x="250" y="700" width="140" height="40" as="geometry" />
        </mxCell>
        <mxCell id="20Lr0uqHoCz4GIKEG1yG-3" value="fs_div_4_generator_csts" style="rounded=0;whiteSpace=wrap;html=1;verticalAlign=top;strokeWidth=2;fontStyle=1" parent="1" vertex="1">
          <mxGeometry x="240" y="780" width="160" height="80" as="geometry" />
        </mxCell>
        <mxCell id="20Lr0uqHoCz4GIKEG1yG-35" style="edgeStyle=orthogonalEdgeStyle;rounded=0;orthogonalLoop=1;jettySize=auto;html=1;exitX=1;exitY=0.5;exitDx=0;exitDy=0;entryX=0;entryY=0.5;entryDx=0;entryDy=0;" parent="1" edge="1">
          <mxGeometry relative="1" as="geometry">
            <mxPoint x="440" y="700" as="targetPoint" />
            <mxPoint x="400" y="700" as="sourcePoint" />
          </mxGeometry>
        </mxCell>
        <mxCell id="20Lr0uqHoCz4GIKEG1yG-34" style="edgeStyle=orthogonalEdgeStyle;rounded=0;orthogonalLoop=1;jettySize=auto;html=1;exitX=1;exitY=0.5;exitDx=0;exitDy=0;entryX=0;entryY=0.5;entryDx=0;entryDy=0;" parent="1" edge="1">
          <mxGeometry relative="1" as="geometry">
            <mxPoint x="440" y="820" as="targetPoint" />
            <mxPoint x="400" y="820" as="sourcePoint" />
          </mxGeometry>
        </mxCell>
        <mxCell id="20Lr0uqHoCz4GIKEG1yG-46" style="edgeStyle=orthogonalEdgeStyle;rounded=0;orthogonalLoop=1;jettySize=auto;html=1;exitX=0;exitY=0.5;exitDx=0;exitDy=0;entryX=1;entryY=0.5;entryDx=0;entryDy=0;" parent="1" source="20Lr0uqHoCz4GIKEG1yG-17" target="20Lr0uqHoCz4GIKEG1yG-22" edge="1">
          <mxGeometry relative="1" as="geometry" />
        </mxCell>
        <mxCell id="20Lr0uqHoCz4GIKEG1yG-17" value="fifo" style="rounded=0;whiteSpace=wrap;html=1;verticalAlign=top;strokeWidth=2;fontStyle=1" parent="1" vertex="1">
          <mxGeometry x="40" y="340" width="160" height="80" as="geometry" />
        </mxCell>
        <mxCell id="20Lr0uqHoCz4GIKEG1yG-19" value="oneshot=true" style="text;html=1;strokeColor=none;fillColor=none;align=left;verticalAlign=middle;whiteSpace=wrap;rounded=0;fontColor=#3399FF;fontSize=10;" parent="1" vertex="1">
          <mxGeometry x="50" y="380" width="140" height="40" as="geometry" />
        </mxCell>
        <mxCell id="20Lr0uqHoCz4GIKEG1yG-22" value="file_write" style="rounded=0;whiteSpace=wrap;html=1;verticalAlign=top;strokeWidth=2;fontStyle=1" parent="1" vertex="1">
          <mxGeometry x="-160" y="340" width="160" height="80" as="geometry" />
        </mxCell>
        <mxCell id="20Lr0uqHoCz4GIKEG1yG-23" value="fileName=j20_rx.bin" style="text;html=1;strokeColor=none;fillColor=none;align=left;verticalAlign=middle;whiteSpace=wrap;rounded=0;fontColor=#3399FF;fontSize=10;" parent="1" vertex="1">
          <mxGeometry x="-150" y="380" width="140" height="40" as="geometry" />
        </mxCell>
        <mxCell id="20Lr0uqHoCz4GIKEG1yG-45" style="edgeStyle=orthogonalEdgeStyle;rounded=0;orthogonalLoop=1;jettySize=auto;html=1;exitX=0;exitY=0.5;exitDx=0;exitDy=0;entryX=1;entryY=0.5;entryDx=0;entryDy=0;" parent="1" target="20Lr0uqHoCz4GIKEG1yG-17" edge="1">
          <mxGeometry relative="1" as="geometry">
            <mxPoint x="240" y="380" as="sourcePoint" />
          </mxGeometry>
        </mxCell>
        <mxCell id="2m1fBvR-V1N9Y2KdnfgO-2" value="rx[1]" style="rounded=0;whiteSpace=wrap;html=1;verticalAlign=middle;strokeWidth=2;fontStyle=1;fontColor=#3399FF;" parent="1" vertex="1">
          <mxGeometry x="440" y="480" width="40" height="40" as="geometry" />
        </mxCell>
        <mxCell id="2m1fBvR-V1N9Y2KdnfgO-3" style="edgeStyle=orthogonalEdgeStyle;rounded=0;orthogonalLoop=1;jettySize=auto;html=1;exitX=0;exitY=0.5;exitDx=0;exitDy=0;entryX=1;entryY=0.5;entryDx=0;entryDy=0;" parent="1" source="2m1fBvR-V1N9Y2KdnfgO-4" target="2m1fBvR-V1N9Y2KdnfgO-6" edge="1">
          <mxGeometry relative="1" as="geometry" />
        </mxCell>
        <mxCell id="2m1fBvR-V1N9Y2KdnfgO-4" value="fifo" style="rounded=0;whiteSpace=wrap;html=1;verticalAlign=top;strokeWidth=2;fontStyle=1" parent="1" vertex="1">
          <mxGeometry x="40" y="460" width="160" height="80" as="geometry" />
        </mxCell>
        <mxCell id="2m1fBvR-V1N9Y2KdnfgO-5" value="oneshot=true" style="text;html=1;strokeColor=none;fillColor=none;align=left;verticalAlign=middle;whiteSpace=wrap;rounded=0;fontColor=#3399FF;fontSize=10;" parent="1" vertex="1">
          <mxGeometry x="50" y="500" width="140" height="40" as="geometry" />
        </mxCell>
        <mxCell id="2m1fBvR-V1N9Y2KdnfgO-6" value="file_write" style="rounded=0;whiteSpace=wrap;html=1;verticalAlign=top;strokeWidth=2;fontStyle=1" parent="1" vertex="1">
          <mxGeometry x="-160" y="460" width="160" height="80" as="geometry" />
        </mxCell>
        <mxCell id="2m1fBvR-V1N9Y2KdnfgO-7" value="fileName=j18_rx.bin" style="text;html=1;strokeColor=none;fillColor=none;align=left;verticalAlign=middle;whiteSpace=wrap;rounded=0;fontColor=#3399FF;fontSize=10;" parent="1" vertex="1">
          <mxGeometry x="-150" y="500" width="140" height="40" as="geometry" />
        </mxCell>
        <mxCell id="2m1fBvR-V1N9Y2KdnfgO-10" style="edgeStyle=orthogonalEdgeStyle;rounded=0;orthogonalLoop=1;jettySize=auto;html=1;exitX=0;exitY=0.5;exitDx=0;exitDy=0;entryX=1;entryY=0.5;entryDx=0;entryDy=0;" parent="1" target="2m1fBvR-V1N9Y2KdnfgO-4" edge="1">
          <mxGeometry relative="1" as="geometry">
            <mxPoint x="240" y="500" as="sourcePoint" />
          </mxGeometry>
        </mxCell>
        <mxCell id="uRD2u4Zk3EAiHj--pMCg-3" style="edgeStyle=orthogonalEdgeStyle;rounded=0;orthogonalLoop=1;jettySize=auto;html=1;exitX=0;exitY=0.5;exitDx=0;exitDy=0;entryX=1;entryY=0.5;entryDx=0;entryDy=0;" parent="1" edge="1">
          <mxGeometry relative="1" as="geometry">
            <mxPoint x="440" y="380" as="sourcePoint" />
            <mxPoint x="400" y="380" as="targetPoint" />
          </mxGeometry>
        </mxCell>
        <mxCell id="uRD2u4Zk3EAiHj--pMCg-4" style="edgeStyle=orthogonalEdgeStyle;rounded=0;orthogonalLoop=1;jettySize=auto;html=1;exitX=0;exitY=0.5;exitDx=0;exitDy=0;" parent="1" edge="1">
          <mxGeometry relative="1" as="geometry">
            <mxPoint x="440" y="500" as="sourcePoint" />
            <mxPoint x="400" y="500" as="targetPoint" />
          </mxGeometry>
        </mxCell>
        <mxCell id="uRD2u4Zk3EAiHj--pMCg-7" value="csts_to_iqstream" style="rounded=0;whiteSpace=wrap;html=1;verticalAlign=top;strokeWidth=2;fontStyle=1" parent="1" vertex="1">
          <mxGeometry x="240" y="340" width="160" height="80" as="geometry" />
        </mxCell>
        <mxCell id="uRD2u4Zk3EAiHj--pMCg-8" value="csts_to_iqstream" style="rounded=0;whiteSpace=wrap;html=1;verticalAlign=top;strokeWidth=2;fontStyle=1" parent="1" vertex="1">
          <mxGeometry x="240" y="460" width="160" height="80" as="geometry" />
        </mxCell>
      </root>
    </mxGraphModel>
  </diagram>
</mxfile>
