<?xml version="1.0" encoding="UTF-8" standalone="no"?>
<!DOCTYPE svg PUBLIC "-//W3C//DTD SVG 1.1//EN" "http://www.w3.org/Graphics/SVG/1.1/DTD/svg11.dtd">
<!-- Generated by Microsoft Visio, SVG Export diagrams.svg Page-1 -->
<svg xmlns="http://www.w3.org/2000/svg" xmlns:xlink="http://www.w3.org/1999/xlink" xmlns:ev="http://www.w3.org/2001/xml-events"
		width="9.62138in" height="7.24264in" viewBox="0 0 692.739 521.47" xml:space="preserve" color-interpolation-filters="sRGB"
		class="st20">
	<style type="text/css">
	<![CDATA[
		.st1 {visibility:visible}
		.st2 {fill:#5b9bd5;fill-opacity:0.22;filter:url(#filter_2);stroke:#5b9bd5;stroke-opacity:0.22}
		.st3 {fill:#5b9bd5;stroke:#c7c8c8;stroke-width:0.25}
		.st4 {fill:#feffff;font-family:Calibri;font-size:1.16666em}
		.st5 {font-size:1em}
		.st6 {fill:none;filter:url(#filter_2);stroke:none}
		.st7 {fill:#5b9bd5;filter:url(#filter_2);font-family:Calibri;font-size:1.16666em;opacity:0.219608}
		.st8 {fill:none;stroke:none;stroke-width:0.25}
		.st9 {fill:#41719c;font-family:Calibri;font-size:1.16666em}
		.st10 {marker-end:url(#mrkr4-32);stroke:#5b9bd5;stroke-linecap:round;stroke-linejoin:round;stroke-width:1}
		.st11 {fill:#5b9bd5;fill-opacity:1;stroke:#5b9bd5;stroke-opacity:1;stroke-width:0.28409090909091}
		.st12 {fill:#5b9bd5;fill-opacity:0.25;filter:url(#filter_2);stroke:#5b9bd5;stroke-opacity:0.25}
		.st13 {fill:#4f87bb;stroke:#40709c;stroke-width:0.75}
		.st14 {stroke:#ffffff;stroke-linecap:round;stroke-linejoin:round;stroke-width:3}
		.st15 {fill:#feffff;font-family:Calibri;font-size:0.833336em}
		.st16 {fill:#feffff;font-family:Calibri;font-size:2.50001em}
		.st17 {fill:#5b9bd5;filter:url(#filter_2);font-family:Calibri;font-size:4.00001em;opacity:0.219608}
		.st18 {fill:#41719c;font-family:Calibri;font-size:4.00001em}
		.st19 {fill:#feffff;font-family:Calibri;font-size:1.99999em}
		.st20 {fill:none;fill-rule:evenodd;font-size:12px;overflow:visible;stroke-linecap:square;stroke-miterlimit:3}
	]]>
	</style>

	<defs id="Markers">
		<g id="lend4">
			<path d="M 2 1 L 0 0 L 2 -1 L 2 1 " style="stroke:none"/>
		</g>
		<marker id="mrkr4-32" class="st11" refX="-7.04" orient="auto" markerUnits="strokeWidth" overflow="visible">
			<use xlink:href="#lend4" transform="scale(-3.52,-3.52) "/>
		</marker>
	</defs>
	<defs id="Filters">
		<filter id="filter_2">
			<feGaussianBlur stdDeviation="2"/>
		</filter>
	</defs>
	<g>
		<title>Page-1</title>
		<g id="shape195-1" transform="translate(159.416,-382.356)">
			<title>Rectangle.195</title>
			<desc>Calculate Error</desc>
			<g id="shadow195-2" transform="matrix(1,0,0,1,0.345598,1.97279)" class="st1">
				<rect x="0" y="450.604" width="63.7795" height="70.8661" class="st2"/>
			</g>
			<rect x="0" y="450.604" width="63.7795" height="70.8661" class="st3"/>
			<text x="5.77" y="481.84" class="st4">Calculate <tspan x="17.46" dy="1.2em" class="st5">Error</tspan></text>		</g>
		<g id="shape196-8" transform="translate(0.25,-394.302)">
			<title>Rectangle.196</title>
			<desc>Sync</desc>
			<g id="shadow196-9" transform="matrix(1,0,0,1,0.345598,1.97279)" class="st1">
				<rect x="0" y="474.698" width="85.0394" height="46.7717" class="st6"/>
				<text x="54.99" y="502.28" class="st7">Sync</text>			</g>
			<rect x="0" y="474.698" width="85.0394" height="46.7717" class="st8"/>
			<text x="54.99" y="502.28" class="st9">Sync</text>		</g>
		<g id="group197-16" transform="translate(201.936,-456.056)">
			<title>Sheet.197</title>
			<g id="shape198-17" transform="translate(-432.887,521.47) rotate(-90)">
				<title>Triangle</title>
				<g id="shadow198-18" transform="matrix(1,0,0,1,-1.97279,0.345598)" class="st1">
					<path d="M63.78 521.47 L31.89 457.69 L0 521.47 L63.78 521.47 Z" class="st2"/>
				</g>
				<path d="M63.78 521.47 L31.89 457.69 L0 521.47 L63.78 521.47 Z" class="st3"/>
			</g>
			<g id="shape199-22" transform="translate(1.39888E-014,-17.7165)">
				<title>Circle</title>
				<g id="shadow199-23" transform="matrix(1,0,0,1,0.345598,1.97279)" class="st1">
					<path d="M0 507.3 A14.1732 14.1732 0 0 1 28.35 507.3 A14.1732 14.1732 0 1 1 0 507.3 Z" class="st2"/>
				</g>
				<path d="M0 507.3 A14.1732 14.1732 0 0 1 28.35 507.3 A14.1732 14.1732 0 1 1 0 507.3 Z" class="st3"/>
			</g>
		</g>
		<g id="shape200-27" transform="translate(223.195,-417.789)">
			<title>Dynamic connector.200</title>
			<path d="M0 521.47 L77.95 521.47 L77.95 451.31 L74.36 451.31" class="st10"/>
		</g>
		<g id="shape201-33" transform="translate(203.707,-487.946)">
			<title>Dynamic connector.201</title>
			<path d="M-1.77 521.47 L-12.4 521.47 L-12.4 549.15" class="st10"/>
		</g>
		<g id="shape202-38" transform="translate(85.2894,-410.652)">
			<title>Dynamic connector.202</title>
			<path d="M0 514.43 L67.09 514.34" class="st10"/>
		</g>
		<g id="shape203-43" transform="translate(0.25,-321.411)">
			<title>Rectangle.203</title>
			<desc>input_valid</desc>
			<g id="shadow203-44" transform="matrix(1,0,0,1,0.345598,1.97279)" class="st1">
				<rect x="0" y="474.698" width="85.0394" height="46.7717" class="st6"/>
				<text x="17.29" y="502.28" class="st7">input_valid</text>			</g>
			<rect x="0" y="474.698" width="85.0394" height="46.7717" class="st8"/>
			<text x="17.29" y="502.28" class="st9">input_valid</text>		</g>
		<g id="shape204-51" transform="translate(0.25,-272.56)">
			<title>Rectangle.204</title>
			<desc>input</desc>
			<g id="shadow204-52" transform="matrix(1,0,0,1,0.345598,1.97279)" class="st1">
				<rect x="0" y="474.698" width="85.0394" height="46.7717" class="st6"/>
				<text x="51.07" y="502.28" class="st7">input</text>			</g>
			<rect x="0" y="474.698" width="85.0394" height="46.7717" class="st8"/>
			<text x="51.07" y="502.28" class="st9">input</text>		</g>
		<g id="shape205-59" transform="translate(85.2894,-288.871)">
			<title>Dynamic connector.205</title>
			<path d="M0 514.39 L47.46 514.38" class="st10"/>
		</g>
		<g id="shape206-64" transform="translate(85.2894,-337.761)">
			<title>Dynamic connector.206</title>
			<path d="M0 514.43 L47.6 514.35" class="st10"/>
		</g>
		<g id="group207-69" transform="translate(139.793,-260.535)">
			<title>Sheet.207</title>
			<g id="shape208-70" transform="translate(184.386,958.577) rotate(180)">
				<title>Simple Arrow</title>
				<desc>LSR</desc>
				<g id="shadow208-71" transform="matrix(1,0,0,1,-0.345598,-1.97279)" class="st1">
					<path d="M0 521.47 L11.34 510.13 L11.34 515.8 L184.25 515.8 L184.25 521.47 L184.25 527.14 L11.34 527.14 L11.34
								 532.81 L0 521.47 Z" class="st12"/>
				</g>
				<path d="M0 521.47 L11.34 510.13 L11.34 515.8 L184.25 515.8 L184.25 521.47 L184.25 527.14 L11.34 527.14 L11.34 532.81
							 L0 521.47 Z" class="st13"/>
				<text x="-102.09" y="-517.27" transform="rotate(180)" class="st4">LSR</text>			</g>
			<g id="group209-76">
				<title>Sheet.209</title>
				<g id="shape210-77">
					<title>Rectangle.134</title>
					<desc>N[0]</desc>
					<g id="shadow210-78" transform="matrix(1,0,0,1,0.345598,1.97279)" class="st1">
						<rect x="0" y="450.604" width="63.7795" height="70.8661" class="st2"/>
					</g>
					<rect x="0" y="450.604" width="63.7795" height="70.8661" class="st3"/>
					<text x="19.53" y="490.24" class="st4">N[0]</text>				</g>
				<g id="shape211-83" transform="translate(63.914,-6.82121E-013)">
					<title>Rectangle.135</title>
					<desc>N[1]</desc>
					<g id="shadow211-84" transform="matrix(1,0,0,1,0.345598,1.97279)" class="st1">
						<rect x="0" y="450.604" width="63.7795" height="70.8661" class="st2"/>
					</g>
					<rect x="0" y="450.604" width="63.7795" height="70.8661" class="st3"/>
					<text x="19.53" y="490.24" class="st4">N[1]</text>				</g>
				<g id="shape212-89" transform="translate(127.694,-6.82121E-013)">
					<title>Rectangle.136</title>
					<desc>N[2]</desc>
					<g id="shadow212-90" transform="matrix(1,0,0,1,0.345598,1.97279)" class="st1">
						<rect x="0" y="450.604" width="63.7795" height="70.8661" class="st2"/>
					</g>
					<rect x="0" y="450.604" width="63.7795" height="70.8661" class="st3"/>
					<text x="19.53" y="490.24" class="st4">N[2]</text>				</g>
			</g>
		</g>
		<g id="group213-95" transform="translate(338.353,-146.371)">
			<title>Sheet.213</title>
			<g id="shape214-96">
				<title>Circle</title>
				<g id="shadow214-97" transform="matrix(1,0,0,1,0.345598,1.97279)" class="st1">
					<path d="M0 498.08 A23.3858 23.3858 0 0 1 46.77 498.08 A23.3858 23.3858 0 1 1 0 498.08 Z" class="st2"/>
				</g>
				<path d="M0 498.08 A23.3858 23.3858 0 0 1 46.77 498.08 A23.3858 23.3858 0 1 1 0 498.08 Z" class="st3"/>
			</g>
			<g id="shape215-101" transform="translate(544.856,474.698) rotate(90)">
				<title>Sheet.215</title>
				<path d="M0 521.47 L46.77 521.47" class="st14"/>
			</g>
			<g id="shape216-104" transform="translate(0,-23.3858)">
				<title>Sheet.216</title>
				<path d="M0 521.47 L46.77 521.47" class="st14"/>
			</g>
		</g>
		<g id="group217-107" transform="translate(404.967,-146.371)">
			<title>Sheet.217</title>
			<g id="shape218-108">
				<title>Circle</title>
				<g id="shadow218-109" transform="matrix(1,0,0,1,0.345598,1.97279)" class="st1">
					<path d="M0 498.08 A23.3858 23.3858 0 0 1 46.77 498.08 A23.3858 23.3858 0 1 1 0 498.08 Z" class="st2"/>
				</g>
				<path d="M0 498.08 A23.3858 23.3858 0 0 1 46.77 498.08 A23.3858 23.3858 0 1 1 0 498.08 Z" class="st3"/>
			</g>
			<g id="shape219-113" transform="translate(-361.888,145.888) rotate(-45)">
				<title>Sheet.219</title>
				<path d="M0 521.47 L46.78 521.47" class="st14"/>
			</g>
			<g id="shape220-116" transform="translate(-328.811,883.358) rotate(-135)">
				<title>Sheet.220</title>
				<path d="M0 521.47 L46.78 521.47" class="st14"/>
			</g>
		</g>
		<g id="shape221-119" transform="translate(299.377,-260.535)">
			<title>Dynamic connector.221</title>
			<path d="M0 521.47 L0 575.68 L62.36 575.68 L62.36 581.82" class="st10"/>
		</g>
		<g id="shape222-124" transform="translate(171.683,-260.535)">
			<title>Dynamic connector.222</title>
			<path d="M0 521.47 L0 612.25 L61.55 612.25 A2.3622 2.3622 0 1 1 66.28 612.25 L125.33 612.25 A2.3622 2.3622 0 1 1 130.06
						 612.25 L159.63 612.25" class="st10"/>
		</g>
		<g id="shape223-129" transform="translate(385.125,-162.671)">
			<title>Dynamic connector.223</title>
			<path d="M0 514.38 L12.8 514.38" class="st10"/>
		</g>
		<g id="shape224-134" transform="translate(235.597,-260.535)">
			<title>Dynamic connector.224</title>
			<path d="M0 521.47 L0 556.58 L61.42 556.58 A2.3622 2.3622 0 1 1 66.14 556.58 L192.76 556.58 L192.76 581.82"
					class="st10"/>
		</g>
		<g id="shape241-139" transform="translate(223.195,-417.789)">
			<title>Dynamic connector.241</title>
			<path d="M0 521.47 L70.87 521.47 L70.87 581.65" class="st10"/>
		</g>
		<g id="shape245-144" transform="translate(1018.86,330.117) rotate(90)">
			<title>Trapezoid.245</title>
			<desc>Output</desc>
			<g id="shadow245-145" transform="matrix(1,0,0,1,1.97279,-0.345598)" class="st1">
				<path d="M0 521.47 L84.36 521.47 L63.27 473.28 L21.09 473.28 L0 521.47 Z" class="st2"/>
			</g>
			<path d="M0 521.47 L84.36 521.47 L63.27 473.28 L21.09 473.28 L0 521.47 Z" class="st3"/>
			<text x="-511.92" y="45.18" transform="rotate(-90)" class="st15">Output</text>		</g>
		<g id="shape246-150" transform="translate(451.739,-176.775)">
			<title>Dynamic connector.246</title>
			<path d="M0 528.49 L38.62 528.6" class="st10"/>
		</g>
		<g id="shape252-155" transform="translate(443.536,-110.893)">
			<title>Rectangle.252</title>
			<desc>0</desc>
			<g id="shadow252-156" transform="matrix(1,0,0,1,0.345598,1.97279)" class="st1">
				<rect x="0" y="489.58" width="31.8898" height="31.8898" class="st2"/>
			</g>
			<rect x="0" y="489.58" width="31.8898" height="31.8898" class="st3"/>
			<text x="8.34" y="514.53" class="st16">0</text>		</g>
		<g id="shape253-161" transform="translate(475.426,-119.882)">
			<title>Dynamic connector.253</title>
			<path d="M0 514.51 L14.93 514.34" class="st10"/>
		</g>
		<g id="shape254-166" transform="translate(605.783,-125)">
			<title>Rectangle.254</title>
			<desc>output_data</desc>
			<g id="shadow254-167" transform="matrix(1,0,0,1,0.345598,1.97279)" class="st1">
				<rect x="0" y="474.698" width="85.0394" height="46.7717" class="st6"/>
				<text x="4" y="502.28" class="st7">output_data</text>			</g>
			<rect x="0" y="474.698" width="85.0394" height="46.7717" class="st8"/>
			<text x="4" y="502.28" class="st9">output_data</text>		</g>
		<g id="shape255-174" transform="translate(605.783,-394.403)">
			<title>Rectangle.255</title>
			<desc>output_valid</desc>
			<g id="shadow255-175" transform="matrix(1,0,0,1,0.345598,1.97279)" class="st1">
				<rect x="0" y="474.698" width="85.0394" height="46.7717" class="st6"/>
				<text x="4" y="502.28" class="st7">output_valid</text>			</g>
			<rect x="0" y="474.698" width="85.0394" height="46.7717" class="st8"/>
			<text x="4" y="502.28" class="st9">output_valid</text>		</g>
		<g id="shape256-182" transform="translate(545.584,-141.286)">
			<title>Dynamic connector.256</title>
			<path d="M0 514.4 L53.16 514.37" class="st10"/>
		</g>
		<g id="shape258-187" transform="translate(367.691,-195.269)">
			<title>Rectangle.258</title>
			<desc>-</desc>
			<g id="shadow258-188" transform="matrix(1,0,0,1,0.345598,1.97279)" class="st1">
				<rect x="0" y="508.173" width="18.8505" height="13.2974" class="st6"/>
				<text x="4" y="529.22" class="st17">-</text>			</g>
			<rect x="0" y="508.173" width="18.8505" height="13.2974" class="st8"/>
			<text x="4" y="529.22" class="st18">-</text>		</g>
		<g id="shape261-195" transform="translate(148.297,-97.4738)">
			<title>Rectangle.261</title>
			<desc>sgn</desc>
			<g id="shadow261-196" transform="matrix(1,0,0,1,0.345598,1.97279)" class="st1">
				<rect x="0" y="474.698" width="46.7717" height="46.7717" class="st2"/>
			</g>
			<rect x="0" y="474.698" width="46.7717" height="46.7717" class="st3"/>
			<text x="6.74" y="505.28" class="st19">sgn</text>		</g>
		<g id="shape262-201" transform="translate(212.211,-97.4738)">
			<title>Rectangle.262</title>
			<desc>sgn</desc>
			<g id="shadow262-202" transform="matrix(1,0,0,1,0.345598,1.97279)" class="st1">
				<rect x="0" y="474.698" width="46.7717" height="46.7717" class="st2"/>
			</g>
			<rect x="0" y="474.698" width="46.7717" height="46.7717" class="st3"/>
			<text x="6.74" y="505.28" class="st19">sgn</text>		</g>
		<g id="shape263-207" transform="translate(275.991,-97.4738)">
			<title>Rectangle.263</title>
			<desc>sgn</desc>
			<g id="shadow263-208" transform="matrix(1,0,0,1,0.345598,1.97279)" class="st1">
				<rect x="0" y="474.698" width="46.7717" height="46.7717" class="st2"/>
			</g>
			<rect x="0" y="474.698" width="46.7717" height="46.7717" class="st3"/>
			<text x="6.74" y="505.28" class="st19">sgn</text>		</g>
		<g id="shape264-213" transform="translate(164.596,-260.535)">
			<title>Dynamic connector.264</title>
			<path d="M7.09 521.47 L7.09 630.72" class="st10"/>
		</g>
		<g id="shape265-218" transform="translate(228.51,-260.535)">
			<title>Dynamic connector.265</title>
			<path d="M7.09 521.47 L7.09 630.72" class="st10"/>
		</g>
		<g id="shape266-223" transform="translate(306.463,-260.535)">
			<title>Dynamic connector.266</title>
			<path d="M-7.09 521.47 L-7.09 630.72" class="st10"/>
		</g>
		<g id="shape267-228" transform="translate(147.652,-5.3478)">
			<title>Rectangle.267</title>
			<desc>(a&#38;!c)|(!a&#38;b) |(!b&#38;c)</desc>
			<g id="shadow267-229" transform="matrix(1,0,0,1,0.345598,1.97279)" class="st1">
				<rect x="0" y="450.604" width="175.748" height="70.8661" class="st2"/>
			</g>
			<rect x="0" y="450.604" width="175.748" height="70.8661" class="st3"/>
			<text x="20.73" y="478.84" class="st19">(a&#38;!c)|(!a&#38;b) <tspan x="51.6" dy="1.2em" class="st5">|</tspan>(!b&#38;c)</text>		</g>
		<g id="shape268-235" transform="translate(164.628,-97.4738)">
			<title>Dynamic connector.268</title>
			<path d="M7.06 521.47 L7.1 535.69" class="st10"/>
		</g>
		<g id="shape269-240" transform="translate(242.648,-97.4738)">
			<title>Dynamic connector.269</title>
			<path d="M-7.05 521.47 L-7.1 535.69" class="st10"/>
		</g>
		<g id="shape270-245" transform="translate(306.427,-97.4738)">
			<title>Dynamic connector.270</title>
			<path d="M-7.05 521.47 L-7.1 535.69" class="st10"/>
		</g>
		<g id="shape272-250" transform="translate(223.195,-410.702)">
			<title>Dynamic connector.272</title>
			<path d="M0 514.38 L375.55 514.38" class="st10"/>
		</g>
		<g id="shape273-255" transform="translate(323.4,-40.7809)">
			<title>Dynamic connector.273</title>
			<path d="M0 521.47 L198.09 521.47 L198.09 451.76" class="st10"/>
		</g>
	</g>
</svg>
