<?xml version="1.0" encoding="UTF-8" standalone="no"?>
<!DOCTYPE svg PUBLIC "-//W3C//DTD SVG 1.1//EN" "http://www.w3.org/Graphics/SVG/1.1/DTD/svg11.dtd">
<!-- Generated by Microsoft Visio, SVG Export output_switch.svg Polyphase -->
<svg xmlns="http://www.w3.org/2000/svg" xmlns:xlink="http://www.w3.org/1999/xlink" xmlns:ev="http://www.w3.org/2001/xml-events"
		width="14.7834in" height="4.20189in" viewBox="0 0 1064.41 302.536" xml:space="preserve" color-interpolation-filters="sRGB"
		class="st17">
	<title>Output Switch</title>

	<style type="text/css">
	<![CDATA[
		.st1 {visibility:visible}
		.st2 {fill:#5b9bd5;fill-opacity:0.22;filter:url(#filter_2);stroke:#5b9bd5;stroke-opacity:0.22}
		.st3 {fill:#5b9bd5;stroke:#c7c8c8;stroke-width:0.25}
		.st4 {fill:#feffff;font-family:Calibri;font-size:1.99999em}
		.st5 {marker-end:url(#mrkr4-24);stroke:#5b9bd5;stroke-linecap:round;stroke-linejoin:round;stroke-width:1}
		.st6 {fill:#5b9bd5;fill-opacity:1;stroke:#5b9bd5;stroke-opacity:1;stroke-width:0.28409090909091}
		.st7 {marker-end:url(#mrkr4-81);stroke:#5b9bd5;stroke-linecap:round;stroke-linejoin:round;stroke-width:3.75}
		.st8 {fill:#5b9bd5;fill-opacity:1;stroke:#5b9bd5;stroke-opacity:1;stroke-width:0.59808612440191}
		.st9 {fill:none;filter:url(#filter_2);stroke:none}
		.st10 {fill:#5b9bd5;filter:url(#filter_2);font-family:Calibri;font-size:2.50001em;opacity:0.219608}
		.st11 {font-size:1em}
		.st12 {fill:none;stroke:none;stroke-width:0.25}
		.st13 {fill:#41719c;font-family:Calibri;font-size:2.50001em}
		.st14 {stroke:#5b9bd5;stroke-linecap:round;stroke-linejoin:round;stroke-width:1}
		.st15 {fill:#5b9bd5;fill-opacity:0.25;filter:url(#filter_2);stroke:#5b9bd5;stroke-opacity:0.25}
		.st16 {fill:#4f87bb;stroke:#40709c;stroke-width:0.75}
		.st17 {fill:none;fill-rule:evenodd;font-size:12px;overflow:visible;stroke-linecap:square;stroke-miterlimit:3}
	]]>
	</style>

	<defs id="Markers">
		<g id="lend4">
			<path d="M 2 1 L 0 0 L 2 -1 L 2 1 " style="stroke:none"/>
		</g>
		<marker id="mrkr4-24" class="st6" refX="-7.04" orient="auto" markerUnits="strokeWidth" overflow="visible">
			<use xlink:href="#lend4" transform="scale(-3.52,-3.52) "/>
		</marker>
		<marker id="mrkr4-81" class="st8" refX="-3.344" orient="auto" markerUnits="strokeWidth" overflow="visible">
			<use xlink:href="#lend4" transform="scale(-1.672,-1.672) "/>
		</marker>
	</defs>
	<defs id="Filters">
		<filter id="filter_2">
			<feGaussianBlur stdDeviation="2"/>
		</filter>
	</defs>
	<g>
		<title>Polyphase</title>
		<g id="shape1-1" transform="translate(795.786,-135.005)">
			<title>Circle.180</title>
			<g id="shadow1-2" transform="matrix(1,0,0,1,0.345598,1.97279)" class="st1">
				<path d="M0 293.11 A9.42523 9.42523 0 0 1 18.85 293.11 A9.42523 9.42523 0 1 1 0 293.11 Z" class="st2"/>
			</g>
			<path d="M0 293.11 A9.42523 9.42523 0 0 1 18.85 293.11 A9.42523 9.42523 0 1 1 0 293.11 Z" class="st3"/>
		</g>
		<g id="group2-6" transform="translate(252.455,-38.1313)">
			<title>Sheet.2</title>
			<g id="group3-7" transform="translate(0,-170.079)">
				<title>Sheet.3</title>
				<g id="shape4-8">
					<title>Rectangle.171</title>
					<desc>FIR Branch 0</desc>
					<g id="shadow4-9" transform="matrix(1,0,0,1,0.345598,1.97279)" class="st1">
						<rect x="0" y="260.016" width="340.157" height="42.5197" class="st2"/>
					</g>
					<rect x="0" y="260.016" width="340.157" height="42.5197" class="st3"/>
					<text x="109.38" y="288.48" class="st4">FIR Branch 0</text>				</g>
				<g id="shape5-14" transform="translate(406.346,-11.8346)">
					<title>Circle</title>
					<g id="shadow5-15" transform="matrix(1,0,0,1,0.345598,1.97279)" class="st1">
						<path d="M0 293.11 A9.42523 9.42523 0 0 1 18.85 293.11 A9.42523 9.42523 0 1 1 0 293.11 Z" class="st2"/>
					</g>
					<path d="M0 293.11 A9.42523 9.42523 0 0 1 18.85 293.11 A9.42523 9.42523 0 1 1 0 293.11 Z" class="st3"/>
				</g>
				<g id="shape6-19" transform="translate(340.157,-14.1732)">
					<title>Dynamic connector.181</title>
					<path d="M0 295.45 L59.15 295.45" class="st5"/>
				</g>
			</g>
			<g id="group7-25" transform="translate(0,-113.386)">
				<title>Sheet.7</title>
				<g id="shape8-26">
					<title>Rectangle.171</title>
					<desc>FIR Branch 1</desc>
					<g id="shadow8-27" transform="matrix(1,0,0,1,0.345598,1.97279)" class="st1">
						<rect x="0" y="260.016" width="340.157" height="42.5197" class="st2"/>
					</g>
					<rect x="0" y="260.016" width="340.157" height="42.5197" class="st3"/>
					<text x="109.38" y="288.48" class="st4">FIR Branch 1</text>				</g>
				<g id="shape9-32" transform="translate(406.346,-11.8346)">
					<title>Circle</title>
					<g id="shadow9-33" transform="matrix(1,0,0,1,0.345598,1.97279)" class="st1">
						<path d="M0 293.11 A9.42523 9.42523 0 0 1 18.85 293.11 A9.42523 9.42523 0 1 1 0 293.11 Z" class="st2"/>
					</g>
					<path d="M0 293.11 A9.42523 9.42523 0 0 1 18.85 293.11 A9.42523 9.42523 0 1 1 0 293.11 Z" class="st3"/>
				</g>
				<g id="shape10-37" transform="translate(340.157,-14.1732)">
					<title>Dynamic connector.181</title>
					<path d="M0 295.45 L59.15 295.45" class="st5"/>
				</g>
			</g>
			<g id="group11-42" transform="translate(0,-56.6929)">
				<title>Sheet.11</title>
				<g id="shape12-43">
					<title>Rectangle.171</title>
					<desc>FIR Branch 2</desc>
					<g id="shadow12-44" transform="matrix(1,0,0,1,0.345598,1.97279)" class="st1">
						<rect x="0" y="260.016" width="340.157" height="42.5197" class="st2"/>
					</g>
					<rect x="0" y="260.016" width="340.157" height="42.5197" class="st3"/>
					<text x="109.38" y="288.48" class="st4">FIR Branch 2</text>				</g>
				<g id="shape13-49" transform="translate(406.346,-11.8346)">
					<title>Circle</title>
					<g id="shadow13-50" transform="matrix(1,0,0,1,0.345598,1.97279)" class="st1">
						<path d="M0 293.11 A9.42523 9.42523 0 0 1 18.85 293.11 A9.42523 9.42523 0 1 1 0 293.11 Z" class="st2"/>
					</g>
					<path d="M0 293.11 A9.42523 9.42523 0 0 1 18.85 293.11 A9.42523 9.42523 0 1 1 0 293.11 Z" class="st3"/>
				</g>
				<g id="shape14-54" transform="translate(340.157,-14.1732)">
					<title>Dynamic connector.181</title>
					<path d="M0 295.45 L59.15 295.45" class="st5"/>
				</g>
			</g>
			<g id="group15-59">
				<title>Sheet.15</title>
				<g id="shape16-60">
					<title>Rectangle.171</title>
					<desc>FIR Branch 3</desc>
					<g id="shadow16-61" transform="matrix(1,0,0,1,0.345598,1.97279)" class="st1">
						<rect x="0" y="260.016" width="340.157" height="42.5197" class="st2"/>
					</g>
					<rect x="0" y="260.016" width="340.157" height="42.5197" class="st3"/>
					<text x="109.38" y="288.48" class="st4">FIR Branch 3</text>				</g>
				<g id="shape17-66" transform="translate(406.346,-11.8346)">
					<title>Circle</title>
					<g id="shadow17-67" transform="matrix(1,0,0,1,0.345598,1.97279)" class="st1">
						<path d="M0 293.11 A9.42523 9.42523 0 0 1 18.85 293.11 A9.42523 9.42523 0 1 1 0 293.11 Z" class="st2"/>
					</g>
					<path d="M0 293.11 A9.42523 9.42523 0 0 1 18.85 293.11 A9.42523 9.42523 0 1 1 0 293.11 Z" class="st3"/>
				</g>
				<g id="shape18-71" transform="translate(340.157,-14.1732)">
					<title>Dynamic connector.181</title>
					<path d="M0 295.45 L59.15 295.45" class="st5"/>
				</g>
			</g>
		</g>
		<g id="shape19-76" transform="translate(805.211,-144.43)">
			<title>Dynamic connector.196</title>
			<path d="M0 302.54 L-119.57 230.63" class="st7"/>
		</g>
		<g id="shape20-82" transform="translate(18.25,-121.045)">
			<title>Rectangle.197</title>
			<desc>Input Sample</desc>
			<g id="shadow20-83" transform="matrix(1,0,0,1,0.345598,1.97279)" class="st1">
				<rect x="0" y="255.765" width="120.82" height="46.7717" class="st9"/>
				<text x="51.93" y="270.15" class="st10">Input <tspan x="27.13" dy="1.2em" class="st11">Sample</tspan></text>			</g>
			<rect x="0" y="255.765" width="120.82" height="46.7717" class="st12"/>
			<text x="51.93" y="270.15" class="st13">Input <tspan x="27.13" dy="1.2em" class="st11">Sample</tspan></text>		</g>
		<g id="shape21-92" transform="translate(894.628,-121.045)">
			<title>Rectangle.198</title>
			<desc>Output Sample</desc>
			<g id="shadow21-93" transform="matrix(1,0,0,1,0.345598,1.97279)" class="st1">
				<rect x="0" y="255.765" width="151.528" height="46.7717" class="st9"/>
				<text x="4" y="270.15" class="st10">Output <tspan x="4" dy="1.2em" class="st11">Sample</tspan></text>			</g>
			<rect x="0" y="255.765" width="151.528" height="46.7717" class="st12"/>
			<text x="4" y="270.15" class="st13">Output <tspan x="4" dy="1.2em" class="st11">Sample</tspan></text>		</g>
		<g id="shape22-102" transform="translate(245.369,-229.47)">
			<title>Dynamic connector.199</title>
			<path d="M7.09 302.54 L-35.43 302.54 L-35.43 472.61 L7.09 472.61" class="st14"/>
		</g>
		<g id="shape23-105" transform="translate(252.455,-176.32)">
			<title>Dynamic connector.200</title>
			<path d="M0 306.08 L-42.52 306.08 L-42.52 313.17" class="st14"/>
		</g>
		<g id="shape24-108" transform="translate(252.455,-119.627)">
			<title>Dynamic connector.201</title>
			<path d="M0 306.08 L-42.52 306.08 L-42.52 313.17" class="st14"/>
		</g>
		<g id="shape25-111" transform="translate(139.07,-140.887)">
			<title>Dynamic connector.202</title>
			<path d="M0 298.99 L70.87 298.99 L70.87 291.91" class="st14"/>
		</g>
		<g id="shape26-114" transform="translate(894.628,-137.344)">
			<title>Dynamic connector.203</title>
			<path d="M0 295.45 L-79.99 295.45" class="st14"/>
		</g>
		<g id="shape27-117" transform="translate(796.308,-75.1291) rotate(-30) scale(-1,1)">
			<title>Circular Arrow</title>
			<g id="shadow27-118" transform="matrix(1,0,0,1,0.687099,1.88129)" class="st1">
				<path d="M177.47 236.39 L195.04 212.51 L183.15 211.6 A85.8493 85.7075 -180 0 0 107.95 119.91 A85.8493 85.7075 0 0
							 1 183.15 211.6 L171.27 210.69 L177.47 236.39 Z" class="st15"/>
			</g>
			<path d="M177.47 236.39 L195.04 212.51 L183.15 211.6 A85.8493 85.7075 -180 0 0 107.95 119.91 A85.8493 85.7075 0 0 1 183.15
						 211.6 L171.27 210.69 L177.47 236.39 Z" class="st16"/>
		</g>
	</g>
</svg>
