<?xml version="1.0" encoding="UTF-8" standalone="no"?>
<!DOCTYPE svg PUBLIC "-//W3C//DTD SVG 1.1//EN" "http://www.w3.org/Graphics/SVG/1.1/DTD/svg11.dtd">
<!-- Generated by Microsoft Visio, SVG Export upsample_timestamp_alignment.svg Page-1 -->
<svg xmlns="http://www.w3.org/2000/svg" xmlns:xlink="http://www.w3.org/1999/xlink" xmlns:ev="http://www.w3.org/2001/xml-events"
		xmlns:v="http://schemas.microsoft.com/visio/2003/SVGExtensions/" width="3.90976in" height="1.02816in"
		viewBox="0 0 281.503 74.0276" xml:space="preserve" color-interpolation-filters="sRGB" class="st9">
	<v:documentProperties v:langID="2057" v:metric="true" v:viewMarkup="false"/>

	<style type="text/css">
	<![CDATA[
		.st1 {fill:none;stroke:none;stroke-linecap:round;stroke-linejoin:round;stroke-width:0.75}
		.st2 {fill:#000000;font-family:Calibri;font-size:1.00001em}
		.st3 {font-size:1em}
		.st4 {fill:#d7e3bf;stroke:none;stroke-width:0.999995}
		.st5 {fill:#000000;font-family:Calibri;font-size:1.5em;font-weight:bold}
		.st6 {fill:#ddd6e5;stroke:none;stroke-width:0.999995}
		.st7 {fill:#d9958f;stroke:none;stroke-width:0.999995}
		.st8 {fill:#fbd7bb;stroke:none;stroke-width:0.999995}
		.st9 {fill:none;fill-rule:evenodd;font-size:12px;overflow:visible;stroke-linecap:square;stroke-miterlimit:3}
	]]>
	</style>

	<g v:mID="0" v:index="1" v:groupContext="foregroundPage">
		<title>Page-1</title>
		<v:pageProperties v:drawingScale="0.0393701" v:pageScale="0.0393701" v:drawingUnits="24" v:shadowOffsetX="9"
				v:shadowOffsetY="-9"/>
		<g id="group138-1" transform="translate(0.375,-0.999995)" v:mID="138" v:groupContext="group">
			<title>Sheet.138</title>
			<g id="shape104-2" v:mID="104" v:groupContext="shape" transform="translate(13.4646,-44.3061)">
				<title>Sheet.104</title>
				<desc>Input Data</desc>
				<v:textBlock v:margins="rect(4,4,4,4)" v:tabSpace="42.5197"/>
				<v:textRect cx="43.2283" cy="59.8543" width="86.46" height="28.3465"/>
				<rect x="0" y="45.6811" width="86.4567" height="28.3465" class="st1"/>
				<text x="30.89" y="63.45" class="st2" v:langID="1033"><v:paragraph v:horizAlign="2"/><v:tabList/>Input Data  </text>			</g>
			<g id="shape105-5" v:mID="105" v:groupContext="shape" transform="translate(-1.59872E-014,-1.78642)">
				<title>Sheet.105</title>
				<desc>Upsampled Output Data</desc>
				<v:textBlock v:margins="rect(4,4,4,4)" v:tabSpace="42.5197"/>
				<v:textRect cx="49.6063" cy="59.8543" width="99.22" height="28.3465"/>
				<rect x="0" y="45.6811" width="99.2126" height="28.3465" class="st1"/>
				<text x="39.85" y="56.25" class="st2" v:langID="1033"><v:paragraph v:horizAlign="2"/><v:tabList/>Upsampled  <tspan
							x="34.7" dy="1.2em" class="st3">Output Data</tspan></text>			</g>
			<g id="group137-9" transform="translate(114.422,7.10543E-014)" v:mID="137" v:groupContext="group">
				<title>Sheet.137</title>
				<g id="shape117-10" v:mID="117" v:groupContext="shape" transform="translate(47.153,-41.8335)">
					<title>Sheet.117</title>
					<desc>2</desc>
					<v:textBlock v:margins="rect(0,0,0,0)" v:tabSpace="42.5197"/>
					<v:textRect cx="24.0945" cy="59.0204" width="48.19" height="30.0142"/>
					<rect x="0" y="44.0133" width="48.189" height="30.0142" class="st4"/>
					<text x="4.07" y="64.42" class="st5" v:langID="1033"><v:paragraph/><v:tabList/>2</text>				</g>
				<g id="shape118-13" v:mID="118" v:groupContext="shape" transform="translate(120.372,-41.8335)">
					<title>Sheet.118</title>
					<desc>3</desc>
					<v:textBlock v:margins="rect(0,0,0,0)" v:tabSpace="42.5197"/>
					<v:textRect cx="22.667" cy="59.0204" width="45.34" height="30.0142"/>
					<rect x="0" y="44.0133" width="45.334" height="30.0142" class="st6"/>
					<text x="4.07" y="64.42" class="st5" v:langID="1033"><v:paragraph/><v:tabList/>3</text>				</g>
				<g id="shape119-16" v:mID="119" v:groupContext="shape" transform="translate(98.1766,-41.8335)">
					<title>Sheet.119</title>
					<desc>T</desc>
					<v:textBlock v:margins="rect(0,0,0,0)" v:tabSpace="42.5197"/>
					<v:textRect cx="8.59783" cy="59.0204" width="17.2" height="30.0142"/>
					<rect x="0" y="44.0133" width="17.1957" height="30.0142" class="st7"/>
					<text x="4.14" y="64.42" class="st5" v:langID="1033"><v:paragraph v:horizAlign="1"/><v:tabList/>T</text>				</g>
				<g id="shape120-19" v:mID="120" v:groupContext="shape" transform="translate(0.00208432,-41.8335)">
					<title>Sheet.120</title>
					<desc>1</desc>
					<v:textBlock v:margins="rect(0,0,0,0)" v:tabSpace="42.5197"/>
					<v:textRect cx="22.667" cy="59.0204" width="45.34" height="30.0142"/>
					<rect x="0" y="44.0133" width="45.334" height="30.0142" class="st8"/>
					<text x="4.07" y="64.42" class="st5" v:langID="1033"><v:paragraph/><v:tabList/>1</text>				</g>
				<g id="shape121-22" v:mID="121" v:groupContext="shape" transform="translate(-7.99361E-015,-0.0263992)">
					<title>Sheet.121</title>
					<desc>A B C</desc>
					<v:textBlock v:margins="rect(0,0,0,0)" v:tabSpace="42.5197"/>
					<v:textRect cx="22.667" cy="59.0204" width="45.34" height="30.0142"/>
					<rect x="0" y="44.0133" width="45.334" height="30.0142" class="st8"/>
					<text x="3.34" y="64.42" class="st5" v:langID="1033"><v:paragraph v:horizAlign="1"/><v:tabList/>A B C</text>				</g>
				<g id="shape123-25" v:mID="123" v:groupContext="shape" transform="translate(120.372,2.84217E-014)">
					<title>Sheet.123</title>
					<desc>H I J</desc>
					<v:textBlock v:margins="rect(0,0,0,0)" v:tabSpace="42.5197"/>
					<v:textRect cx="22.667" cy="59.0204" width="45.34" height="30.0142"/>
					<path d="M0 44.01 L45.33 44.01 L45.33 74.03 L0 74.03 L0 44.01 Z" class="st6"/>
					<text x="4.07" y="64.42" class="st5" v:langID="1033"><v:paragraph/><v:tabList/>H I J</text>				</g>
				<g id="shape133-28" v:mID="133" v:groupContext="shape" transform="translate(47.3768,-0.11864)">
					<title>Sheet.133</title>
					<desc>D E F</desc>
					<v:textBlock v:margins="rect(0,0,0,0)" v:tabSpace="42.5197"/>
					<v:textRect cx="24.0945" cy="59.0204" width="48.19" height="30.0142"/>
					<rect x="0" y="44.0133" width="48.189" height="30.0142" class="st4"/>
					<text x="4.07" y="64.42" class="st5" v:langID="1033"><v:paragraph/><v:tabList/>D E F</text>				</g>
				<g id="shape134-31" v:mID="134" v:groupContext="shape" transform="translate(98.1766,-0.11864)">
					<title>Sheet.134</title>
					<desc>T</desc>
					<v:textBlock v:margins="rect(0,0,0,0)" v:tabSpace="42.5197"/>
					<v:textRect cx="8.59783" cy="59.0204" width="17.2" height="30.0142"/>
					<rect x="0" y="44.0133" width="17.1957" height="30.0142" class="st7"/>
					<text x="4.14" y="64.42" class="st5" v:langID="1033"><v:paragraph v:horizAlign="1"/><v:tabList/>T</text>				</g>
			</g>
		</g>
	</g>
</svg>
