<?xml version="1.0" encoding="UTF-8" standalone="no"?>
<!DOCTYPE svg PUBLIC "-//W3C//DTD SVG 1.1//EN" "http://www.w3.org/Graphics/SVG/1.1/DTD/svg11.dtd">
<!-- Generated by Microsoft Visio, SVG Export Halfband_interpolator.svg Page-1 -->
<svg xmlns="http://www.w3.org/2000/svg" xmlns:xlink="http://www.w3.org/1999/xlink" xmlns:ev="http://www.w3.org/2001/xml-events"
		width="12.8763in" height="6.89591in" viewBox="0 0 927.094 496.506" xml:space="preserve" color-interpolation-filters="sRGB"
		class="st12">
	<style type="text/css">
	<![CDATA[
		.st1 {fill:#ffffff;stroke:none;stroke-width:1.5}
		.st2 {fill:#000000;font-family:Calibri;font-size:1.16666em}
		.st3 {fill:#ffffff;stroke:#000000;stroke-width:1.5}
		.st4 {fill:#000000;font-family:Calibri;font-size:1.99999em}
		.st5 {baseline-shift:32.4951%;font-size:0.649901em}
		.st6 {stroke:#000000;stroke-linecap:round;stroke-linejoin:round;stroke-width:1.5}
		.st7 {marker-end:url(#mrkr4-53);stroke:#000000;stroke-linecap:round;stroke-linejoin:round;stroke-width:1.5}
		.st8 {fill:#000000;fill-opacity:1;stroke:#000000;stroke-opacity:1;stroke-width:0.37313432835821}
		.st9 {visibility:visible}
		.st10 {fill:none;filter:url(#filter_2);stroke:#5b9bd5;stroke-dasharray:10.5,7.5,0.01,7.5;stroke-opacity:0.22}
		.st11 {fill:none;stroke:#000000;stroke-dasharray:10.5,7.5,0.01,7.5;stroke-width:1.5}
		.st12 {fill:none;fill-rule:evenodd;font-size:12px;overflow:visible;stroke-linecap:square;stroke-miterlimit:3}
	]]>
	</style>

	<defs id="Markers">
		<g id="lend4">
			<path d="M 2 1 L 0 0 L 2 -1 L 2 1 " style="stroke:none"/>
		</g>
		<marker id="mrkr4-53" class="st8" refX="-5.36" orient="auto" markerUnits="strokeWidth" overflow="visible">
			<use xlink:href="#lend4" transform="scale(-2.68,-2.68) "/>
		</marker>
	</defs>
	<defs id="Filters">
		<filter id="filter_2">
			<feGaussianBlur stdDeviation="2"/>
		</filter>
	</defs>
	<g>
		<title>Page-1</title>
		<g id="group409-1" transform="translate(1.5,-1.5)">
			<title>Sheet.409</title>
			<g id="shape317-2" transform="translate(-6.59472E-014,-356.7)">
				<title>Rectangle.59</title>
				<desc>x(n)</desc>
				<rect x="0" y="449.734" width="31.8898" height="46.7717" class="st1"/>
				<text x="5.98" y="477.32" class="st2">x(n)</text>			</g>
			<g id="shape318-5" transform="translate(223.228,-356.7)">
				<title>Rectangle.25</title>
				<desc>Z-2</desc>
				<rect x="0" y="449.734" width="46.7717" height="46.7717" class="st3"/>
				<text x="11.43" y="480.32" class="st4">Z<tspan dy="-0.234em" class="st5">-</tspan><tspan class="st5">2</tspan></text> 
			</g>
			<g id="group319-10" transform="translate(147.402,-289.155)">
				<title>Sheet.319</title>
				<g id="shape320-11">
					<title>Circle</title>
					<path d="M0 473.12 A23.3858 23.3858 0 0 1 46.77 473.12 A23.3858 23.3858 0 1 1 0 473.12 Z" class="st3"/>
				</g>
				<g id="shape321-13" transform="translate(519.891,449.734) rotate(90)">
					<title>Sheet.321</title>
					<path d="M0 496.51 L46.77 496.51" class="st6"/>
				</g>
				<g id="shape322-16" transform="translate(0,-23.3858)">
					<title>Sheet.322</title>
					<path d="M0 496.51 L46.77 496.51" class="st6"/>
				</g>
			</g>
			<g id="group323-19" transform="translate(147.402,-186.621)">
				<title>Sheet.323</title>
				<g id="shape324-20">
					<title>Circle</title>
					<path d="M0 473.12 A23.3858 23.3858 0 0 1 46.77 473.12 A23.3858 23.3858 0 1 1 0 473.12 Z" class="st3"/>
				</g>
				<g id="shape325-22" transform="translate(-344.235,138.576) rotate(-45)">
					<title>Sheet.325</title>
					<path d="M0 496.51 L46.78 496.51" class="st6"/>
				</g>
				<g id="shape326-25" transform="translate(-311.158,840.741) rotate(-135)">
					<title>Sheet.326</title>
					<path d="M0 496.51 L46.78 496.51" class="st6"/>
				</g>
			</g>
			<g id="group327-28" transform="translate(147.402,-84.0876)">
				<title>Sheet.327</title>
				<g id="shape328-29">
					<title>Circle</title>
					<path d="M0 473.12 A23.3858 23.3858 0 0 1 46.77 473.12 A23.3858 23.3858 0 1 1 0 473.12 Z" class="st3"/>
				</g>
				<g id="shape329-31" transform="translate(519.891,449.734) rotate(90)">
					<title>Sheet.329</title>
					<path d="M0 496.51 L46.77 496.51" class="st6"/>
				</g>
				<g id="shape330-34" transform="translate(0,-23.3858)">
					<title>Sheet.330</title>
					<path d="M0 496.51 L46.77 496.51" class="st6"/>
				</g>
			</g>
			<g id="shape331-37" transform="translate(223.228,-429.449)">
				<title>Rectangle.52</title>
				<desc>Z-2</desc>
				<rect x="0" y="449.734" width="46.7717" height="46.7717" class="st3"/>
				<text x="11.43" y="480.32" class="st4">Z<tspan dy="-0.234em" class="st5">-</tspan><tspan class="st5">2</tspan></text>
			</g>
			<g id="shape332-42" transform="translate(223.228,-452.835)">
				<title>Dynamic connector.53</title>
				<path d="M0 496.51 L-86.46 496.51 L-86.46 636.8 L-75.83 636.8" class="st6"/>
			</g>
			<g id="shape333-45" transform="translate(194.173,-312.54)">
				<title>Dynamic connector.54</title>
				<path d="M0 496.51 L10.63 496.51 L10.63 428.96 L29.06 428.96" class="st6"/>
			</g>
			<g id="shape334-48" transform="translate(163.701,-289.155)">
				<title>Dynamic connector.55</title>
				<path d="M7.09 496.51 L7.09 544.23" class="st7"/>
			</g>
			<g id="shape335-54" transform="translate(163.701,-186.621)">
				<title>Dynamic connector.56</title>
				<path d="M7.09 496.51 L7.09 544.23" class="st7"/>
			</g>
			<g id="shape336-59" transform="translate(94.2519,-186.621)">
				<title>Rectangle.57</title>
				<desc>h(0)</desc>
				<rect x="0" y="449.734" width="31.8898" height="46.7717" class="st1"/>
				<text x="4.95" y="477.32" class="st2">h(0)</text>			</g>
			<g id="shape337-62" transform="translate(126.142,-202.92)">
				<title>Dynamic connector.58</title>
				<path d="M0 489.42 L13.22 489.42" class="st7"/>
			</g>
			<g id="shape338-67" transform="translate(31.8898,-372.999)">
				<title>Dynamic connector.61</title>
				<path d="M0 489.42 L16.76 489.42" class="st7"/>
			</g>
			<g id="shape339-72" transform="translate(440.787,-356.7)">
				<title>Rectangle.64</title>
				<desc>Z-2</desc>
				<rect x="0" y="449.734" width="46.7717" height="46.7717" class="st3"/>
				<text x="11.43" y="480.32" class="st4">Z<tspan dy="-0.234em" class="st5">-</tspan><tspan class="st5">2</tspan></text>
			</g>
			<g id="group340-77" transform="translate(364.961,-289.155)">
				<title>Sheet.340</title>
				<g id="shape341-78">
					<title>Circle</title>
					<path d="M0 473.12 A23.3858 23.3858 0 0 1 46.77 473.12 A23.3858 23.3858 0 1 1 0 473.12 Z" class="st3"/>
				</g>
				<g id="shape342-80" transform="translate(519.891,449.734) rotate(90)">
					<title>Sheet.342</title>
					<path d="M0 496.51 L46.77 496.51" class="st6"/>
				</g>
				<g id="shape343-83" transform="translate(0,-23.3858)">
					<title>Sheet.343</title>
					<path d="M0 496.51 L46.77 496.51" class="st6"/>
				</g>
			</g>
			<g id="group344-86" transform="translate(364.961,-186.621)">
				<title>Sheet.344</title>
				<g id="shape345-87">
					<title>Circle</title>
					<path d="M0 473.12 A23.3858 23.3858 0 0 1 46.77 473.12 A23.3858 23.3858 0 1 1 0 473.12 Z" class="st3"/>
				</g>
				<g id="shape346-89" transform="translate(-344.235,138.576) rotate(-45)">
					<title>Sheet.346</title>
					<path d="M0 496.51 L46.78 496.51" class="st6"/>
				</g>
				<g id="shape347-92" transform="translate(-311.158,840.741) rotate(-135)">
					<title>Sheet.347</title>
					<path d="M0 496.51 L46.78 496.51" class="st6"/>
				</g>
			</g>
			<g id="group348-95" transform="translate(364.961,-84.0876)">
				<title>Sheet.348</title>
				<g id="shape349-96">
					<title>Circle</title>
					<path d="M0 473.12 A23.3858 23.3858 0 0 1 46.77 473.12 A23.3858 23.3858 0 1 1 0 473.12 Z" class="st3"/>
				</g>
				<g id="shape350-98" transform="translate(519.891,449.734) rotate(90)">
					<title>Sheet.350</title>
					<path d="M0 496.51 L46.77 496.51" class="st6"/>
				</g>
				<g id="shape351-101" transform="translate(0,-23.3858)">
					<title>Sheet.351</title>
					<path d="M0 496.51 L46.77 496.51" class="st6"/>
				</g>
			</g>
			<g id="shape352-104" transform="translate(440.787,-429.449)">
				<title>Rectangle.77</title>
				<desc>Z-2</desc>
				<rect x="0" y="449.734" width="46.7717" height="46.7717" class="st3"/>
				<text x="11.43" y="480.32" class="st4">Z<tspan dy="-0.234em" class="st5">-</tspan><tspan class="st5">2</tspan></text>
			</g>
			<g id="shape353-109" transform="translate(440.787,-452.835)">
				<title>Dynamic connector</title>
				<path d="M0 496.51 L-86.46 496.51 L-86.46 636.8 L-75.83 636.8" class="st6"/>
			</g>
			<g id="shape354-112" transform="translate(411.732,-312.54)">
				<title>Dynamic connector.79</title>
				<path d="M0 496.51 L10.63 496.51 L10.63 428.96 L29.06 428.96" class="st6"/>
			</g>
			<g id="shape355-115" transform="translate(381.26,-289.155)">
				<title>Dynamic connector.80</title>
				<path d="M7.09 496.51 L7.09 544.23" class="st7"/>
			</g>
			<g id="shape356-120" transform="translate(381.26,-186.621)">
				<title>Dynamic connector.81</title>
				<path d="M7.09 496.51 L7.09 544.23" class="st7"/>
			</g>
			<g id="shape357-125" transform="translate(313.937,-186.621)">
				<title>Rectangle.82</title>
				<desc>h(1)</desc>
				<rect x="0" y="449.734" width="31.8898" height="46.7717" class="st1"/>
				<text x="4.95" y="477.32" class="st2">h(1)</text>			</g>
			<g id="shape358-128" transform="translate(343.701,-202.92)">
				<title>Dynamic connector.83</title>
				<path d="M0 489.42 L13.22 489.42" class="st7"/>
			</g>
			<g id="shape359-133" transform="translate(270,-372.999)">
				<title>Dynamic connector.84</title>
				<path d="M0 489.42 L81.97 489.42 A2.3622 2.3622 0 0 1 86.69 489.42 L162.75 489.42" class="st7"/>
			</g>
			<g id="shape360-138" transform="translate(633.958,-356.7)">
				<title>Rectangle.86</title>
				<desc>Z-1</desc>
				<rect x="0" y="449.734" width="46.7717" height="46.7717" class="st3"/>
				<text x="11.43" y="480.32" class="st4">Z<tspan dy="-0.234em" class="st5">-</tspan><tspan class="st5">1</tspan></text>
			</g>
			<g id="group361-143" transform="translate(558.132,-289.155)">
				<title>Sheet.361</title>
				<g id="shape362-144">
					<title>Circle</title>
					<path d="M0 473.12 A23.3858 23.3858 0 0 1 46.77 473.12 A23.3858 23.3858 0 1 1 0 473.12 Z" class="st3"/>
				</g>
				<g id="shape363-146" transform="translate(519.891,449.734) rotate(90)">
					<title>Sheet.363</title>
					<path d="M0 496.51 L46.77 496.51" class="st6"/>
				</g>
				<g id="shape364-149" transform="translate(0,-23.3858)">
					<title>Sheet.364</title>
					<path d="M0 496.51 L46.77 496.51" class="st6"/>
				</g>
			</g>
			<g id="group365-152" transform="translate(558.132,-186.621)">
				<title>Sheet.365</title>
				<g id="shape366-153">
					<title>Circle</title>
					<path d="M0 473.12 A23.3858 23.3858 0 0 1 46.77 473.12 A23.3858 23.3858 0 1 1 0 473.12 Z" class="st3"/>
				</g>
				<g id="shape367-155" transform="translate(-344.235,138.576) rotate(-45)">
					<title>Sheet.367</title>
					<path d="M0 496.51 L46.78 496.51" class="st6"/>
				</g>
				<g id="shape368-158" transform="translate(-311.158,840.741) rotate(-135)">
					<title>Sheet.368</title>
					<path d="M0 496.51 L46.78 496.51" class="st6"/>
				</g>
			</g>
			<g id="group369-161" transform="translate(558.132,-84.0876)">
				<title>Sheet.369</title>
				<g id="shape370-162">
					<title>Circle</title>
					<path d="M0 473.12 A23.3858 23.3858 0 0 1 46.77 473.12 A23.3858 23.3858 0 1 1 0 473.12 Z" class="st3"/>
				</g>
				<g id="shape371-164" transform="translate(519.891,449.734) rotate(90)">
					<title>Sheet.371</title>
					<path d="M0 496.51 L46.77 496.51" class="st6"/>
				</g>
				<g id="shape372-167" transform="translate(0,-23.3858)">
					<title>Sheet.372</title>
					<path d="M0 496.51 L46.77 496.51" class="st6"/>
				</g>
			</g>
			<g id="shape373-170" transform="translate(633.958,-429.449)">
				<title>Rectangle.99</title>
				<desc>Z-1</desc>
				<rect x="0" y="449.734" width="46.7717" height="46.7717" class="st3"/>
				<text x="11.43" y="480.32" class="st4">Z<tspan dy="-0.234em" class="st5">-</tspan><tspan class="st5">1</tspan></text>
			</g>
			<g id="shape374-175" transform="translate(633.958,-452.835)">
				<title>Dynamic connector.100</title>
				<path d="M0 496.51 L-86.46 496.51 L-86.46 636.8 L-75.83 636.8" class="st6"/>
			</g>
			<g id="shape375-178" transform="translate(604.903,-312.54)">
				<title>Dynamic connector.101</title>
				<path d="M0 496.51 L10.63 496.51 L10.63 428.96 L29.06 428.96" class="st6"/>
			</g>
			<g id="shape376-181" transform="translate(574.431,-289.155)">
				<title>Dynamic connector.102</title>
				<path d="M7.09 496.51 L7.09 544.23" class="st7"/>
			</g>
			<g id="shape377-186" transform="translate(574.431,-186.621)">
				<title>Dynamic connector.103</title>
				<path d="M7.09 496.51 L7.09 544.23" class="st7"/>
			</g>
			<g id="shape378-191" transform="translate(512.362,-186.621)">
				<title>Rectangle.104</title>
				<desc>h(2)</desc>
				<rect x="0" y="449.734" width="31.8898" height="46.7717" class="st1"/>
				<text x="4.95" y="477.32" class="st2">h(2)</text>			</g>
			<g id="shape379-194" transform="translate(544.105,-202.92)">
				<title>Dynamic connector.105</title>
				<path d="M0.15 489.42 L5.99 489.42" class="st7"/>
			</g>
			<g id="shape380-199" transform="translate(487.559,-372.999)">
				<title>Dynamic connector.106</title>
				<path d="M0 489.42 L57.58 489.42 A2.3622 2.3622 0 0 1 62.3 489.42 L138.36 489.42" class="st7"/>
			</g>
			<g id="group381-204" transform="translate(717.52,-186.621)">
				<title>Sheet.381</title>
				<g id="shape382-205">
					<title>Circle</title>
					<path d="M0 473.12 A23.3858 23.3858 0 0 1 46.77 473.12 A23.3858 23.3858 0 1 1 0 473.12 Z" class="st3"/>
				</g>
				<g id="shape383-207" transform="translate(-344.235,138.576) rotate(-45)">
					<title>Sheet.383</title>
					<path d="M0 496.51 L46.78 496.51" class="st6"/>
				</g>
				<g id="shape384-210" transform="translate(-311.158,840.741) rotate(-135)">
					<title>Sheet.384</title>
					<path d="M0 496.51 L46.78 496.51" class="st6"/>
				</g>
			</g>
			<g id="group385-213" transform="translate(717.52,-84.0876)">
				<title>Sheet.385</title>
				<g id="shape386-214">
					<title>Circle</title>
					<path d="M0 473.12 A23.3858 23.3858 0 0 1 46.77 473.12 A23.3858 23.3858 0 1 1 0 473.12 Z" class="st3"/>
				</g>
				<g id="shape387-216" transform="translate(519.891,449.734) rotate(90)">
					<title>Sheet.387</title>
					<path d="M0 496.51 L46.77 496.51" class="st6"/>
				</g>
				<g id="shape388-219" transform="translate(0,-23.3858)">
					<title>Sheet.388</title>
					<path d="M0 496.51 L46.77 496.51" class="st6"/>
				</g>
			</g>
			<g id="shape389-222" transform="translate(673.643,-380.086)">
				<title>Dynamic connector.122</title>
				<path d="M7.09 496.51 L67.26 496.51 L67.26 423.76 L7.09 423.76" class="st6"/>
			</g>
			<g id="shape390-225" transform="translate(680.73,-380.086)">
				<title>Dynamic connector.124</title>
				<path d="M0 496.51 L60.18 496.51 L60.18 635.16" class="st7"/>
			</g>
			<g id="shape391-230" transform="translate(733.819,-186.621)">
				<title>Dynamic connector.125</title>
				<path d="M7.09 496.51 L7.09 544.23" class="st7"/>
			</g>
			<g id="shape392-235" transform="translate(620.433,-186.621)">
				<title>Rectangle.126</title>
				<desc>h((N-1)/2)</desc>
				<rect x="0" y="449.734" width="75.8268" height="46.7717" class="st1"/>
				<text x="11.64" y="477.32" class="st2">h((N-1)/2)</text>			</g>
			<g id="shape393-238" transform="translate(696.26,-202.92)">
				<title>Dynamic connector.127</title>
				<path d="M0 489.42 L13.22 489.42" class="st7"/>
			</g>
			<g id="shape394-243" transform="translate(633.958,-445.748)">
				<title>Dynamic connector.129</title>
				<path d="M0 489.42 L-138.36 489.42" class="st7"/>
			</g>
			<g id="shape395-248" transform="translate(440.787,-445.748)">
				<title>Dynamic connector.130</title>
				<path d="M0 489.42 L-162.75 489.42" class="st7"/>
			</g>
			<g id="shape396-253" transform="translate(194.173,-100.387)">
				<title>Dynamic connector.131</title>
				<path d="M0 489.42 L162.75 489.42" class="st7"/>
			</g>
			<g id="shape397-258" transform="translate(411.732,-100.387)">
				<title>Dynamic connector.132</title>
				<path d="M0 489.42 L138.36 489.42" class="st7"/>
			</g>
			<g id="shape398-263" transform="translate(604.903,-100.387)">
				<title>Dynamic connector.133</title>
				<path d="M0 489.42 L104.58 489.42" class="st7"/>
			</g>
			<g id="shape399-268" transform="translate(892.205,-84.0876)">
				<title>Rectangle.134</title>
				<desc>y(n)</desc>
				<rect x="0" y="449.734" width="31.8898" height="46.7717" class="st1"/>
				<text x="4" y="477.32" class="st2">y(n)</text>			</g>
			<g id="shape400-271" transform="translate(764.291,-100.387)">
				<title>Dynamic connector.135</title>
				<path d="M0 489.42 L119.87 489.42" class="st7"/>
			</g>
			<g id="shape401-276" transform="translate(308.356,-53.8583)">
				<title>Rectangle</title>
				<g id="shadow401-277" transform="matrix(1,0,0,1,0.345598,1.97279)" class="st9">
					<path d="M0 496.51 L207.55 496.51 L207.55 57.14 L0 57.14 L0 496.51 Z" class="st10"/>
				</g>
				<path d="M0 496.51 L207.55 496.51 L207.55 57.14 L0 57.14 L0 496.51 Z" class="st11"/>
			</g>
			<g id="shape402-281" transform="translate(303.307,-1.7053E-013)">
				<title>Rectangle.137</title>
				<desc>Repeated for (N-1)/2 Taps</desc>
				<rect x="0" y="449.734" width="207.55" height="46.7717" class="st1"/>
				<text x="29.57" y="466.33" class="st2">Repeated for (N-1)/2 Taps</text>			</g>
			<g id="shape405-284" transform="translate(56.6929,-356.7)">
				<title>Rectangle.313</title>
				<desc>↑2</desc>
				<rect x="0" y="449.734" width="46.7717" height="46.7717" class="st3"/>
				<text x="6.44" y="480.32" class="st4">↑2</text>			</g>
			<g id="shape407-287" transform="translate(103.465,-372.999)">
				<title>Dynamic connector.407</title>
				<path d="M0 489.42 L30.94 489.42 A2.3622 2.3622 0 1 1 35.67 489.42 L111.72 489.42" class="st7"/>
			</g>
		</g>
	</g>
</svg>
