<?xml version="1.0" encoding="UTF-8"?>
<!DOCTYPE svg PUBLIC "-//W3C//DTD SVG 1.1//EN" "http://www.w3.org/Graphics/SVG/1.1/DTD/svg11.dtd">
<svg version="1.2" width="142.83mm" height="57.48mm" viewBox="3032 22952 14283 5748" preserveAspectRatio="xMidYMid" fill-rule="evenodd" stroke-width="28.222" stroke-linejoin="round" xmlns="http://www.w3.org/2000/svg" xmlns:ooo="http://xml.openoffice.org/svg/export" xmlns:xlink="http://www.w3.org/1999/xlink" xmlns:presentation="http://sun.com/xmlns/staroffice/presentation" xmlns:smil="http://www.w3.org/2001/SMIL20/" xmlns:anim="urn:oasis:names:tc:opendocument:xmlns:animation:1.0" xml:space="preserve">
 <defs class="ClipPathGroup">
  <clipPath id="presentation_clip_path" clipPathUnits="userSpaceOnUse">
   <rect x="3032" y="22952" width="14283" height="5748"/>
  </clipPath>
  <clipPath id="presentation_clip_path_shrink" clipPathUnits="userSpaceOnUse">
   <rect x="3046" y="22957" width="14255" height="5737"/>
  </clipPath>
 </defs>
 <defs>
  <font id="EmbeddedFont_1" horiz-adv-x="2048">
   <font-face font-family="Liberation Mono embedded" units-per-em="2048" font-weight="normal" font-style="normal" ascent="1693" descent="609"/>
   <missing-glyph horiz-adv-x="2048" d="M 0,0 L 2047,0 2047,2047 0,2047 0,0 Z"/>
   <glyph unicode="v" horiz-adv-x="1112" d="M 715,0 L 502,0 69,1082 271,1082 539,378 C 544,363 550,346 556,325 562,304 568,282 575,259 582,236 588,215 594,194 599,173 604,155 608,141 612,155 617,173 624,194 630,215 636,236 643,258 650,280 657,302 664,323 671,344 677,361 682,376 L 958,1082 1159,1082 715,0 Z"/>
   <glyph unicode="u" horiz-adv-x="900" d="M 365,1082 L 365,396 C 365,343 369,299 377,264 384,229 397,200 415,179 432,157 455,142 484,133 512,124 547,119 589,119 632,119 670,127 705,142 739,157 768,178 793,207 817,235 836,270 849,312 862,353 868,401 868,455 L 868,1082 1049,1082 1049,231 C 1049,208 1049,185 1050,160 1050,135 1050,111 1051,89 1052,66 1052,47 1053,31 1054,15 1054,5 1055,0 L 885,0 C 884,3 884,12 883,27 882,42 882,59 881,78 880,97 879,116 878,136 877,155 877,172 877,185 L 874,185 C 857,154 838,125 817,100 796,75 772,53 745,36 718,18 686,4 651,-6 616,-15 575,-20 528,-20 468,-20 416,-13 373,2 330,17 294,39 266,70 238,101 218,140 205,189 192,237 185,294 185,361 L 185,1082 365,1082 Z"/>
   <glyph unicode="t" horiz-adv-x="848" d="M 190,940 L 190,1082 360,1082 418,1364 538,1364 538,1082 970,1082 970,940 538,940 538,288 C 538,235 552,196 581,171 609,146 655,133 720,133 747,133 774,134 803,137 831,139 858,142 885,145 911,148 936,152 959,156 982,160 1001,164 1017,167 L 1017,30 C 1002,26 983,21 960,16 937,11 911,6 882,1 853,-4 821,-8 787,-11 753,-14 718,-16 682,-16 574,-16 493,7 439,53 385,98 358,170 358,269 L 358,940 190,940 Z"/>
   <glyph unicode="r" horiz-adv-x="821" d="M 1045,918 C 1014,923 981,928 947,932 912,935 874,937 833,937 777,937 727,926 682,903 637,880 600,850 569,811 538,772 515,726 499,674 482,622 474,567 474,508 L 474,0 294,0 294,701 C 294,738 292,776 288,815 284,854 279,890 274,925 269,959 263,990 257,1017 251,1044 246,1066 242,1082 L 413,1082 C 418,1066 423,1048 428,1027 433,1006 437,985 442,963 447,940 451,918 454,895 457,872 460,851 461,832 L 466,832 C 485,873 504,911 525,944 546,977 570,1006 599,1029 627,1052 660,1070 699,1083 738,1096 784,1102 839,1102 876,1102 913,1100 949,1097 985,1094 1017,1090 1045,1085 L 1045,918 Z"/>
   <glyph unicode="p" horiz-adv-x="927" d="M 1090,546 C 1090,464 1083,388 1070,319 1057,250 1035,190 1004,140 973,90 933,51 883,23 833,-6 771,-20 698,-20 661,-20 626,-17 593,-10 560,-3 529,7 500,22 471,37 446,56 424,79 401,102 382,131 367,164 L 362,164 C 363,163 363,157 364,147 364,136 364,123 365,108 365,93 365,75 366,56 366,37 366,17 366,-2 L 366,-425 185,-425 185,858 C 185,885 185,910 185,935 184,960 184,982 183,1002 182,1021 182,1038 181,1052 180,1066 180,1076 179,1082 L 354,1082 C 355,1080 356,1073 357,1061 358,1048 359,1033 360,1016 361,999 362,980 363,960 364,940 364,921 364,904 L 368,904 C 385,939 404,969 425,994 446,1019 469,1040 496,1057 523,1073 553,1085 586,1093 619,1100 657,1104 698,1104 771,1104 833,1091 883,1064 933,1037 973,1000 1004,951 1035,902 1057,843 1070,774 1083,705 1090,629 1090,546 Z M 904,546 C 904,613 900,672 892,724 884,776 870,820 851,856 831,891 805,918 773,937 740,956 700,965 651,965 612,965 575,959 540,947 505,934 475,912 450,880 424,847 404,802 389,745 374,688 366,614 366,524 366,447 372,383 385,331 397,278 415,236 439,204 463,171 493,148 528,134 563,120 604,113 649,113 698,113 738,123 771,142 804,161 830,188 850,225 869,262 883,307 892,361 900,415 904,477 904,546 Z"/>
   <glyph unicode="o" horiz-adv-x="1006" d="M 1097,542 C 1097,447 1086,365 1064,295 1041,224 1009,166 967,119 925,72 874,38 814,15 753,-8 685,-20 609,-20 536,-20 471,-9 412,14 353,37 302,71 261,118 219,165 187,223 164,294 141,364 130,447 130,542 130,728 172,868 257,962 341,1055 460,1102 615,1102 778,1102 899,1056 978,963 1057,870 1097,730 1097,542 Z M 908,542 C 908,626 901,695 887,750 872,805 852,848 827,881 801,914 770,937 735,950 700,963 661,969 618,969 575,969 535,962 498,949 461,935 430,912 404,879 377,846 357,802 342,747 327,692 319,624 319,542 319,458 327,389 343,334 358,279 379,235 406,202 432,169 463,146 498,133 533,120 569,113 607,113 650,113 691,120 728,133 765,146 796,168 823,201 850,234 871,278 886,333 901,388 908,458 908,542 Z"/>
   <glyph unicode="n" horiz-adv-x="900" d="M 868,0 L 868,695 C 868,748 863,792 852,827 841,861 825,888 806,909 786,929 763,943 736,951 709,959 680,963 648,963 609,963 572,956 538,941 503,926 473,904 448,876 422,847 402,812 387,771 372,729 365,681 365,627 L 365,0 185,0 185,851 C 185,874 185,898 185,923 184,948 184,971 183,994 182,1016 182,1035 181,1051 180,1067 180,1077 179,1082 L 349,1082 C 350,1079 350,1070 351,1055 352,1040 353,1024 354,1005 355,986 355,966 356,947 357,927 357,910 357,897 L 360,897 C 376,928 395,957 417,982 438,1007 463,1029 492,1047 520,1064 552,1078 587,1088 622,1097 662,1102 706,1102 761,1102 810,1095 853,1080 896,1065 932,1043 961,1012 990,981 1012,942 1027,894 1042,846 1049,788 1049,721 L 1049,0 868,0 Z"/>
   <glyph unicode="i" horiz-adv-x="1007" d="M 745,142 L 1125,142 1125,0 143,0 143,142 565,142 565,940 246,940 246,1082 745,1082 745,142 Z M 545,1292 L 545,1484 745,1484 745,1292 545,1292 Z"/>
   <glyph unicode="e" horiz-adv-x="980" d="M 322,503 C 322,446 328,394 341,347 354,299 373,258 398,224 423,189 455,163 493,144 530,125 574,115 623,115 660,115 694,119 725,128 756,136 783,147 808,162 833,177 853,194 870,215 887,235 899,257 907,281 L 1065,236 C 1054,206 1038,176 1017,146 996,115 967,88 932,64 897,39 854,19 803,4 752,-12 692,-20 623,-20 546,-20 478,-8 417,16 356,40 305,76 263,123 221,170 189,230 167,301 144,372 133,454 133,548 133,652 146,739 173,810 199,881 234,938 279,981 324,1024 375,1055 434,1074 492,1093 553,1102 617,1102 704,1102 778,1088 839,1060 899,1032 948,993 986,943 1024,892 1052,832 1069,761 1086,690 1094,612 1094,527 L 1094,503 322,503 Z M 619,969 C 588,969 556,964 523,955 489,945 458,928 429,903 400,878 376,845 357,803 337,760 326,706 324,641 L 908,641 C 903,704 891,756 874,798 857,840 835,874 810,899 784,924 755,942 722,953 689,964 655,969 619,969 Z"/>
   <glyph unicode="_" horiz-adv-x="1271" d="M -5,-220 L -5,-124 1233,-124 1233,-220 -5,-220 Z"/>
  </font>
 </defs>
 <defs>
  <font id="EmbeddedFont_2" horiz-adv-x="2048">
   <font-face font-family="Liberation Serif embedded" units-per-em="2048" font-weight="normal" font-style="normal" ascent="1799" descent="423"/>
   <missing-glyph horiz-adv-x="2048" d="M 0,0 L 2047,0 2047,2047 0,2047 0,0 Z"/>
   <glyph unicode="1" horiz-adv-x="742" d="M 627,80 L 901,53 901,0 180,0 180,53 455,80 455,1174 184,1077 184,1130 575,1352 627,1352 627,80 Z"/>
   <glyph unicode="0" horiz-adv-x="901" d="M 946,676 C 946,564 937,465 920,378 902,291 875,219 839,160 803,101 757,56 702,26 647,-5 581,-20 506,-20 365,-20 258,39 186,158 114,277 78,449 78,676 78,898 114,1068 186,1186 258,1303 367,1362 514,1362 655,1362 763,1304 836,1188 909,1071 946,901 946,676 Z M 762,676 C 762,772 758,858 750,933 741,1008 727,1072 708,1124 688,1175 662,1215 629,1242 596,1269 555,1282 506,1282 457,1282 416,1269 385,1242 353,1215 328,1175 310,1124 292,1072 280,1008 273,933 266,858 262,772 262,676 262,580 266,494 273,418 280,341 292,277 310,224 328,171 353,130 385,102 416,73 457,59 506,59 555,59 596,73 629,102 662,130 688,171 708,224 727,277 741,341 750,418 758,494 762,580 762,676 Z"/>
  </font>
 </defs>
 <defs>
  <font id="EmbeddedFont_3" horiz-adv-x="2048">
   <font-face font-family="Liberation Serif embedded" units-per-em="2048" font-weight="normal" font-style="italic" ascent="1799" descent="423"/>
   <missing-glyph horiz-adv-x="2048" d="M 0,0 L 2047,0 2047,2047 0,2047 0,0 Z"/>
   <glyph unicode="y" horiz-adv-x="1112" d="M 52,940 L 308,940 453,208 688,614 C 710,653 726,688 737,721 747,753 752,782 752,807 752,832 745,851 731,866 717,881 702,890 686,895 L 694,940 884,940 C 890,935 896,926 902,915 907,904 910,891 910,877 910,856 904,828 893,793 882,758 860,713 827,657 L 431,-9 C 392,-76 355,-136 320,-189 285,-242 250,-288 215,-325 180,-362 143,-391 105,-411 66,-431 24,-441 -22,-441 -39,-441 -54,-441 -68,-441 -80,-441 -92,-440 -104,-438 -114,-437 -125,-435 -136,-433 -147,-430 -158,-428 -171,-424 L -134,-221 -89,-221 -73,-317 C -56,-332 -29,-340 9,-340 38,-340 66,-332 93,-315 120,-298 145,-277 170,-251 194,-224 217,-195 238,-163 259,-131 277,-100 294,-70 L 339,12 156,870 44,895 52,940 Z"/>
   <glyph unicode="n" horiz-adv-x="901" d="M 755,748 C 755,778 747,802 731,821 715,840 690,849 655,849 627,849 598,843 569,830 540,817 511,800 484,779 457,758 431,735 408,709 385,682 365,656 349,630 L 239,0 73,0 226,871 108,896 116,941 394,941 367,749 C 392,782 419,811 447,838 474,865 503,887 533,906 562,925 593,939 624,950 655,960 686,965 718,965 749,965 777,961 802,953 827,945 848,932 866,915 883,898 897,876 907,849 916,822 921,791 921,754 921,746 920,735 919,722 917,708 915,693 912,677 909,661 907,645 904,628 901,611 899,595 896,580 L 808,69 939,45 931,0 630,0 732,582 C 735,597 737,612 740,628 743,644 745,660 748,675 750,690 752,704 753,717 754,730 755,740 755,748 Z"/>
   <glyph unicode="e" horiz-adv-x="821" d="M 863,760 C 863,717 849,676 822,637 795,598 755,564 703,533 650,502 586,476 509,455 432,434 343,420 244,413 243,407 243,398 242,385 241,372 240,357 240,340 240,307 243,276 250,245 256,214 267,187 283,163 299,139 321,120 348,106 375,91 410,84 452,84 512,84 567,94 618,115 669,135 716,158 760,184 L 789,142 C 768,124 743,105 714,86 685,67 654,49 621,34 587,18 551,5 514,-5 477,-15 439,-20 400,-20 343,-20 294,-12 252,5 210,21 175,44 147,74 119,104 98,141 84,184 70,227 63,276 63,330 63,389 70,446 83,501 96,555 115,606 139,653 163,700 192,742 225,781 258,819 295,852 334,879 373,906 414,928 458,943 501,958 546,965 591,965 634,965 672,960 706,950 739,939 768,925 791,907 814,888 832,867 845,842 857,817 863,789 863,760 Z M 252,476 C 325,481 388,493 443,511 498,528 543,550 580,576 616,601 643,630 661,662 679,693 688,726 688,760 688,797 678,828 658,852 637,876 608,888 569,888 530,888 493,876 458,851 423,826 392,793 365,754 337,715 313,671 294,622 275,573 261,524 252,476 Z"/>
   <glyph unicode="d" horiz-adv-x="980" d="M 783,941 C 784,949 785,961 787,976 789,991 791,1006 794,1023 797,1039 799,1055 802,1070 804,1085 806,1098 808,1108 L 851,1352 697,1376 705,1421 1029,1421 789,70 902,45 894,0 609,0 638,156 C 582,97 528,53 477,24 426,-6 376,-21 329,-21 289,-21 253,-13 220,2 187,17 159,40 136,69 113,98 95,133 82,175 69,217 62,264 62,317 62,374 68,430 81,485 94,539 112,590 135,638 158,686 187,730 220,770 253,809 290,844 331,873 372,902 417,924 466,940 514,956 565,964 618,964 651,964 682,962 709,958 736,954 760,948 783,941 Z M 760,837 C 737,852 713,864 688,873 663,882 633,886 598,886 562,886 528,878 497,863 466,848 437,827 410,801 383,774 360,743 339,708 318,673 300,635 285,594 270,553 259,511 252,468 244,425 240,382 240,339 240,297 245,261 254,232 263,202 276,178 291,159 306,140 323,126 343,117 362,108 382,104 403,104 440,104 481,116 525,141 568,165 610,199 651,243 L 760,837 Z"/>
  </font>
 </defs>
 <defs>
  <font id="EmbeddedFont_4" horiz-adv-x="2048">
   <font-face font-family="OpenSymbol embedded" units-per-em="2048" font-weight="normal" font-style="normal" ascent="1402" descent="423"/>
   <missing-glyph horiz-adv-x="2048" d="M 0,0 L 2047,0 2047,2047 0,2047 0,0 Z"/>
   <glyph unicode="+" horiz-adv-x="980" d="M 512,115 L 512,516 115,516 115,684 512,684 512,1083 682,1083 682,684 1081,684 1081,516 682,516 682,115 512,115 Z"/>
  </font>
 </defs>
 <defs class="TextShapeIndex">
  <g ooo:slide="id1" ooo:id-list="id3 id4 id5 id6 id7 id8 id9 id10 id11 id12 id13 id14 id15 id16 id17 id18 id19 id20 id21 id22 id23 id24 id25 id26 id27 id28 id29 id30 id31 id32 id33 id34 id35 id36 id37 id38 id39 id40 id41 id42 id43 id44 id45 id46 id47 id48 id49 id50 id51 id52 id53"/>
 </defs>
 <defs class="EmbeddedBulletChars">
  <g id="bullet-char-template(57356)" transform="scale(0.00048828125,-0.00048828125)">
   <path d="M 580,1141 L 1163,571 580,0 -4,571 580,1141 Z"/>
  </g>
  <g id="bullet-char-template(57354)" transform="scale(0.00048828125,-0.00048828125)">
   <path d="M 8,1128 L 1137,1128 1137,0 8,0 8,1128 Z"/>
  </g>
  <g id="bullet-char-template(10146)" transform="scale(0.00048828125,-0.00048828125)">
   <path d="M 174,0 L 602,739 174,1481 1456,739 174,0 Z M 1358,739 L 309,1346 659,739 1358,739 Z"/>
  </g>
  <g id="bullet-char-template(10132)" transform="scale(0.00048828125,-0.00048828125)">
   <path d="M 2015,739 L 1276,0 717,0 1260,543 174,543 174,936 1260,936 717,1481 1274,1481 2015,739 Z"/>
  </g>
  <g id="bullet-char-template(10007)" transform="scale(0.00048828125,-0.00048828125)">
   <path d="M 0,-2 C -7,14 -16,27 -25,37 L 356,567 C 262,823 215,952 215,954 215,979 228,992 255,992 264,992 276,990 289,987 310,991 331,999 354,1012 L 381,999 492,748 772,1049 836,1024 860,1049 C 881,1039 901,1025 922,1006 886,937 835,863 770,784 769,783 710,716 594,584 L 774,223 C 774,196 753,168 711,139 L 727,119 C 717,90 699,76 672,76 641,76 570,178 457,381 L 164,-76 C 142,-110 111,-127 72,-127 30,-127 9,-110 8,-76 1,-67 -2,-52 -2,-32 -2,-23 -1,-13 0,-2 Z"/>
  </g>
  <g id="bullet-char-template(10004)" transform="scale(0.00048828125,-0.00048828125)">
   <path d="M 285,-33 C 182,-33 111,30 74,156 52,228 41,333 41,471 41,549 55,616 82,672 116,743 169,778 240,778 293,778 328,747 346,684 L 369,508 C 377,444 397,411 428,410 L 1163,1116 C 1174,1127 1196,1133 1229,1133 1271,1133 1292,1118 1292,1087 L 1292,965 C 1292,929 1282,901 1262,881 L 442,47 C 390,-6 338,-33 285,-33 Z"/>
  </g>
  <g id="bullet-char-template(9679)" transform="scale(0.00048828125,-0.00048828125)">
   <path d="M 813,0 C 632,0 489,54 383,161 276,268 223,411 223,592 223,773 276,916 383,1023 489,1130 632,1184 813,1184 992,1184 1136,1130 1245,1023 1353,916 1407,772 1407,592 1407,412 1353,268 1245,161 1136,54 992,0 813,0 Z"/>
  </g>
  <g id="bullet-char-template(8226)" transform="scale(0.00048828125,-0.00048828125)">
   <path d="M 346,457 C 273,457 209,483 155,535 101,586 74,649 74,723 74,796 101,859 155,911 209,963 273,989 346,989 419,989 480,963 531,910 582,859 608,796 608,723 608,648 583,586 532,535 482,483 420,457 346,457 Z"/>
  </g>
  <g id="bullet-char-template(8211)" transform="scale(0.00048828125,-0.00048828125)">
   <path d="M -4,459 L 1135,459 1135,606 -4,606 -4,459 Z"/>
  </g>
  <g id="bullet-char-template(61548)" transform="scale(0.00048828125,-0.00048828125)">
   <path d="M 173,740 C 173,903 231,1043 346,1159 462,1274 601,1332 765,1332 928,1332 1067,1274 1183,1159 1299,1043 1357,903 1357,740 1357,577 1299,437 1183,322 1067,206 928,148 765,148 601,148 462,206 346,322 231,437 173,577 173,740 Z"/>
  </g>
 </defs>
 <defs class="TextEmbeddedBitmaps"/>
 <g class="SlideGroup">
  <g>
   <g id="container-id1">
    <g id="id1" class="Slide" clip-path="url(#presentation_clip_path)">
     <g class="Page">
      <g class="com.sun.star.drawing.TextShape">
       <g id="id3">
        <rect class="BoundingBox" stroke="none" fill="none" x="13440" y="22952" width="3876" height="1124"/>
        <text class="TextShape"><tspan class="TextParagraph" font-family="Liberation Mono, monospace" font-size="388px" font-weight="400"><tspan class="TextPosition" x="13690" y="23399"><tspan fill="rgb(0,0,0)" stroke="none">invert_output</tspan></tspan></tspan></text>
       </g>
      </g>
      <g class="OLE2">
       <g id="id4">
        <rect class="BoundingBox" stroke="none" fill="none" x="3932" y="25910" width="425" height="467"/>
        <defs>
         <clipPath id="clip_path_1" clipPathUnits="userSpaceOnUse">
          <path d="M 3942,25903 L 4366,25903 4366,26379 3942,26379 3942,25903 Z"/>
         </clipPath>
        </defs>
        <g clip-path="url(#clip_path_1)">
         <text class="TextShape"><tspan class="TextParagraph" font-family="Liberation Serif, serif" font-size="422px" font-style="italic" font-weight="400"><tspan class="TextPosition" x="4038" y="26280"><tspan fill="rgb(0,0,0)" stroke="none">n</tspan></tspan></tspan></text>
        </g>
       </g>
      </g>
      <g class="OLE2">
       <g id="id5">
        <rect class="BoundingBox" stroke="none" fill="none" x="14673" y="25910" width="412" height="467"/>
        <defs>
         <clipPath id="clip_path_2" clipPathUnits="userSpaceOnUse">
          <path d="M 14684,25903 L 15081,25903 15081,26379 14684,26379 14684,25903 Z"/>
         </clipPath>
        </defs>
        <g clip-path="url(#clip_path_2)">
         <text class="TextShape"><tspan class="TextParagraph" font-family="Liberation Serif, serif" font-size="422px" font-weight="400"><tspan class="TextPosition" x="14779" y="26280"><tspan fill="rgb(0,0,0)" stroke="none">1</tspan></tspan></tspan></text>
        </g>
       </g>
      </g>
      <g class="com.sun.star.drawing.CustomShape">
       <g id="id6">
        <rect class="BoundingBox" stroke="none" fill="none" x="12512" y="23437" width="843" height="1233"/>
        <path fill="none" stroke="rgb(0,0,0)" stroke-width="40" stroke-linejoin="round" d="M 13333,24053 L 12532,24649 12532,23458 13333,24053 Z"/>
       </g>
      </g>
      <g class="com.sun.star.drawing.LineShape">
       <g id="id7">
        <rect class="BoundingBox" stroke="none" fill="none" x="11475" y="23858" width="1019" height="353"/>
        <path fill="none" stroke="rgb(0,0,0)" stroke-width="35" stroke-linejoin="round" d="M 11493,24034 L 11988,24034"/>
        <path fill="rgb(0,0,0)" stroke="none" d="M 12493,24034 L 11965,23858 11965,24210 12493,24034 Z"/>
       </g>
      </g>
      <g class="OLE2">
       <g id="id8">
        <rect class="BoundingBox" stroke="none" fill="none" x="11118" y="25910" width="446" height="467"/>
        <defs>
         <clipPath id="clip_path_3" clipPathUnits="userSpaceOnUse">
          <path d="M 11113,25903 L 11562,25903 11562,26379 11113,26379 11113,25903 Z"/>
         </clipPath>
        </defs>
        <g clip-path="url(#clip_path_3)">
         <text class="TextShape"><tspan class="TextParagraph" font-family="Liberation Serif, serif" font-size="422px" font-style="italic" font-weight="400"><tspan class="TextPosition" x="11224" y="26280"><tspan fill="rgb(0,0,0)" stroke="none">d</tspan></tspan></tspan></text>
        </g>
       </g>
      </g>
      <g class="OLE2">
       <g id="id9">
        <rect class="BoundingBox" stroke="none" fill="none" x="3032" y="28234" width="472" height="467"/>
        <defs>
         <clipPath id="clip_path_4" clipPathUnits="userSpaceOnUse">
          <path d="M 3043,28231 L 3493,28231 3493,28707 3043,28707 3043,28231 Z"/>
         </clipPath>
        </defs>
        <g clip-path="url(#clip_path_4)">
         <text class="TextShape"><tspan class="TextParagraph" font-family="Liberation Serif, serif" font-size="422px" font-style="italic" font-weight="400"><tspan class="TextPosition" x="3191" y="28604"><tspan fill="rgb(0,0,0)" stroke="none">y</tspan></tspan></tspan></text>
        </g>
       </g>
      </g>
      <g class="Group">
       <g class="com.sun.star.drawing.CustomShape">
        <g id="id10">
         <rect class="BoundingBox" stroke="none" fill="none" x="10136" y="23932" width="1042" height="1042"/>
         <path fill="none" stroke="rgb(0,0,0)" stroke-width="40" stroke-linejoin="round" d="M 10656,23952 C 10939,23952 11156,24169 11156,24452 11156,24735 10939,24952 10656,24952 10373,24952 10156,24735 10156,24452 10156,24169 10373,23952 10656,23952 Z"/>
        </g>
       </g>
       <g class="OLE2">
        <g id="id11">
         <rect class="BoundingBox" stroke="none" fill="none" x="10411" y="24354" width="491" height="234"/>
         <defs>
          <clipPath id="clip_path_5" clipPathUnits="userSpaceOnUse">
           <path d="M 10398,24342 L 10901,24342 10901,24580 10398,24580 10398,24342 Z"/>
          </clipPath>
         </defs>
         <g clip-path="url(#clip_path_5)">
          <text class="TextShape"><tspan class="TextParagraph" font-family="OpenSymbol" font-size="422px" font-weight="400"><tspan class="TextPosition" x="10517" y="24592"><tspan fill="rgb(0,0,0)" stroke="none">+</tspan></tspan></tspan></text>
         </g>
        </g>
       </g>
      </g>
      <g class="com.sun.star.drawing.LineShape">
       <g id="id12">
        <rect class="BoundingBox" stroke="none" fill="none" x="10483" y="25012" width="353" height="1751"/>
        <path fill="none" stroke="rgb(0,0,0)" stroke-width="35" stroke-linejoin="round" d="M 10659,26527 L 10659,25517"/>
        <path fill="rgb(0,0,0)" stroke="none" d="M 10682,26513 L 10705,26519 10728,26531 10748,26547 10764,26567 10776,26590 10782,26613 10785,26636 10782,26659 10776,26683 10764,26705 10748,26725 10728,26741 10705,26752 10682,26760 10658,26762 10636,26760 10612,26752 10590,26741 10570,26725 10554,26705 10542,26683 10536,26659 10533,26636 10536,26613 10542,26590 10554,26567 10570,26547 10590,26531 10612,26519 10636,26513 10658,26510 10682,26513 Z"/>
        <path fill="rgb(0,0,0)" stroke="none" d="M 10659,25012 L 10483,25540 10835,25540 10659,25012 Z"/>
       </g>
      </g>
      <g class="com.sun.star.drawing.CustomShape">
       <g id="id13">
        <rect class="BoundingBox" stroke="none" fill="none" x="13328" y="23908" width="292" height="292"/>
        <path fill="none" stroke="rgb(0,0,0)" stroke-width="40" stroke-linejoin="round" d="M 13473,23928 C 13544,23928 13598,23982 13598,24053 13598,24124 13544,24178 13473,24178 13402,24178 13348,24124 13348,24053 13348,23982 13402,23928 13473,23928 Z"/>
       </g>
      </g>
      <g class="Group">
       <g class="com.sun.star.drawing.CustomShape">
        <g id="id14">
         <rect class="BoundingBox" stroke="none" fill="none" x="14462" y="26405" width="837" height="1237"/>
         <path fill="none" stroke="rgb(0,0,0)" stroke-width="35" stroke-linejoin="round" d="M 14880,27623 L 14480,27623 14480,26423 15280,26423 15280,27623 14880,27623 Z"/>
        </g>
       </g>
       <g class="com.sun.star.drawing.CustomShape">
        <g id="id15">
         <rect class="BoundingBox" stroke="none" fill="none" x="15060" y="27116" width="243" height="342"/>
         <path fill="none" stroke="rgb(0,0,0)" stroke-width="40" stroke-linejoin="round" d="M 15080,27287 L 15280,27136 15280,27437 15080,27287 Z"/>
        </g>
       </g>
      </g>
      <g class="com.sun.star.drawing.CustomShape">
       <g id="id16">
        <rect class="BoundingBox" stroke="none" fill="none" x="14810" y="23681" width="867" height="1542"/>
        <path fill="none" stroke="rgb(0,0,0)" stroke-width="40" stroke-linejoin="round" d="M 14831,25202 L 14831,23702 15655,24077 15655,24827 14831,25202 Z"/>
       </g>
      </g>
      <g class="com.sun.star.drawing.LineShape">
       <g id="id17">
        <rect class="BoundingBox" stroke="none" fill="none" x="13679" y="23877" width="1019" height="353"/>
        <path fill="none" stroke="rgb(0,0,0)" stroke-width="35" stroke-linejoin="round" d="M 13697,24053 L 14192,24053"/>
        <path fill="rgb(0,0,0)" stroke="none" d="M 14697,24053 L 14169,23877 14169,24229 14697,24053 Z"/>
       </g>
      </g>
      <g class="com.sun.star.drawing.LineShape">
       <g id="id18">
        <rect class="BoundingBox" stroke="none" fill="none" x="11479" y="24721" width="3219" height="353"/>
        <path fill="none" stroke="rgb(0,0,0)" stroke-width="35" stroke-linejoin="round" d="M 11497,24897 L 14192,24897"/>
        <path fill="rgb(0,0,0)" stroke="none" d="M 14697,24897 L 14169,24721 14169,25073 14697,24897 Z"/>
       </g>
      </g>
      <g class="com.sun.star.drawing.LineShape">
       <g id="id19">
        <rect class="BoundingBox" stroke="none" fill="none" x="11155" y="24276" width="525" height="353"/>
        <path fill="none" stroke="rgb(0,0,0)" stroke-width="35" stroke-linejoin="round" d="M 11173,24452 L 11350,24452"/>
        <path fill="rgb(0,0,0)" stroke="none" d="M 11331,24420 L 11340,24388 11356,24356 11378,24327 11407,24305 11439,24289 11471,24280 11503,24276 11535,24280 11568,24289 11600,24305 11628,24327 11650,24356 11666,24388 11676,24420 11679,24453 11676,24484 11666,24517 11650,24548 11628,24577 11600,24599 11568,24615 11535,24624 11503,24628 11471,24624 11439,24615 11407,24599 11378,24577 11356,24548 11340,24517 11331,24484 11327,24453 11331,24420 Z"/>
       </g>
      </g>
      <g class="com.sun.star.drawing.LineShape">
       <g id="id20">
        <rect class="BoundingBox" stroke="none" fill="none" x="11487" y="24002" width="37" height="937"/>
        <path fill="none" stroke="rgb(0,0,0)" stroke-width="35" stroke-linejoin="round" d="M 11505,24920 L 11505,24020"/>
       </g>
      </g>
      <g class="com.sun.star.drawing.LineShape">
       <g id="id21">
        <rect class="BoundingBox" stroke="none" fill="none" x="15710" y="24434" width="437" height="37"/>
        <path fill="none" stroke="rgb(0,0,0)" stroke-width="35" stroke-linejoin="round" d="M 15728,24452 L 16128,24452"/>
       </g>
      </g>
      <g class="com.sun.star.drawing.LineShape">
       <g id="id22">
        <rect class="BoundingBox" stroke="none" fill="none" x="16097" y="24443" width="37" height="2208"/>
        <path fill="none" stroke="rgb(0,0,0)" stroke-width="35" stroke-linejoin="round" d="M 16115,26632 L 16115,24461"/>
       </g>
      </g>
      <g class="com.sun.star.drawing.LineShape">
       <g id="id23">
        <rect class="BoundingBox" stroke="none" fill="none" x="15331" y="26450" width="819" height="354"/>
        <path fill="none" stroke="rgb(0,0,0)" stroke-width="35" stroke-linejoin="round" d="M 16131,26626 L 15836,26626"/>
        <path fill="rgb(0,0,0)" stroke="none" d="M 15331,26626 L 15859,26802 15859,26450 15331,26626 Z"/>
       </g>
      </g>
      <g class="Group">
       <g class="com.sun.star.drawing.CustomShape">
        <g id="id24">
         <rect class="BoundingBox" stroke="none" fill="none" x="12705" y="26405" width="837" height="1237"/>
         <path fill="none" stroke="rgb(0,0,0)" stroke-width="35" stroke-linejoin="round" d="M 13123,27623 L 12723,27623 12723,26423 13523,26423 13523,27623 13123,27623 Z"/>
        </g>
       </g>
       <g class="com.sun.star.drawing.CustomShape">
        <g id="id25">
         <rect class="BoundingBox" stroke="none" fill="none" x="13303" y="27116" width="243" height="342"/>
         <path fill="none" stroke="rgb(0,0,0)" stroke-width="40" stroke-linejoin="round" d="M 13323,27287 L 13523,27136 13523,27437 13323,27287 Z"/>
        </g>
       </g>
      </g>
      <g class="com.sun.star.drawing.LineShape">
       <g id="id26">
        <rect class="BoundingBox" stroke="none" fill="none" x="13552" y="26450" width="919" height="354"/>
        <path fill="none" stroke="rgb(0,0,0)" stroke-width="35" stroke-linejoin="round" d="M 14452,26626 L 14057,26626"/>
        <path fill="rgb(0,0,0)" stroke="none" d="M 13552,26626 L 14080,26802 14080,26450 13552,26626 Z"/>
       </g>
      </g>
      <g class="Group">
       <g class="com.sun.star.drawing.CustomShape">
        <g id="id27">
         <rect class="BoundingBox" stroke="none" fill="none" x="10909" y="26405" width="837" height="1237"/>
         <path fill="none" stroke="rgb(0,0,0)" stroke-width="35" stroke-linejoin="round" d="M 11327,27623 L 10927,27623 10927,26423 11727,26423 11727,27623 11327,27623 Z"/>
        </g>
       </g>
       <g class="com.sun.star.drawing.CustomShape">
        <g id="id28">
         <rect class="BoundingBox" stroke="none" fill="none" x="11507" y="27116" width="243" height="342"/>
         <path fill="none" stroke="rgb(0,0,0)" stroke-width="40" stroke-linejoin="round" d="M 11527,27287 L 11727,27136 11727,27437 11527,27287 Z"/>
        </g>
       </g>
      </g>
      <g class="com.sun.star.drawing.LineShape">
       <g id="id29">
        <rect class="BoundingBox" stroke="none" fill="none" x="11775" y="26450" width="919" height="354"/>
        <path fill="none" stroke="rgb(0,0,0)" stroke-width="35" stroke-linejoin="round" d="M 12675,26626 L 12280,26626"/>
        <path fill="rgb(0,0,0)" stroke="none" d="M 11775,26626 L 12303,26802 12303,26450 11775,26626 Z"/>
       </g>
      </g>
      <g class="Group">
       <g class="com.sun.star.drawing.CustomShape">
        <g id="id30">
         <rect class="BoundingBox" stroke="none" fill="none" x="9114" y="26405" width="837" height="1237"/>
         <path fill="none" stroke="rgb(0,0,0)" stroke-width="35" stroke-linejoin="round" d="M 9532,27623 L 9132,27623 9132,26423 9932,26423 9932,27623 9532,27623 Z"/>
        </g>
       </g>
       <g class="com.sun.star.drawing.CustomShape">
        <g id="id31">
         <rect class="BoundingBox" stroke="none" fill="none" x="9712" y="27116" width="242" height="342"/>
         <path fill="none" stroke="rgb(0,0,0)" stroke-width="40" stroke-linejoin="round" d="M 9732,27287 L 9932,27136 9932,27437 9732,27287 Z"/>
        </g>
       </g>
      </g>
      <g class="com.sun.star.drawing.LineShape">
       <g id="id32">
        <rect class="BoundingBox" stroke="none" fill="none" x="9980" y="26450" width="919" height="354"/>
        <path fill="none" stroke="rgb(0,0,0)" stroke-width="35" stroke-linejoin="round" d="M 10880,26626 L 10485,26626"/>
        <path fill="rgb(0,0,0)" stroke="none" d="M 9980,26626 L 10508,26802 10508,26450 9980,26626 Z"/>
       </g>
      </g>
      <g class="Group">
       <g class="com.sun.star.drawing.CustomShape">
        <g id="id33">
         <rect class="BoundingBox" stroke="none" fill="none" x="7318" y="26405" width="837" height="1237"/>
         <path fill="none" stroke="rgb(0,0,0)" stroke-width="35" stroke-linejoin="round" d="M 7736,27623 L 7336,27623 7336,26423 8136,26423 8136,27623 7736,27623 Z"/>
        </g>
       </g>
       <g class="com.sun.star.drawing.CustomShape">
        <g id="id34">
         <rect class="BoundingBox" stroke="none" fill="none" x="7916" y="27116" width="242" height="342"/>
         <path fill="none" stroke="rgb(0,0,0)" stroke-width="40" stroke-linejoin="round" d="M 7936,27287 L 8136,27136 8136,27437 7936,27287 Z"/>
        </g>
       </g>
      </g>
      <g class="com.sun.star.drawing.LineShape">
       <g id="id35">
        <rect class="BoundingBox" stroke="none" fill="none" x="8184" y="26450" width="919" height="354"/>
        <path fill="none" stroke="rgb(0,0,0)" stroke-width="35" stroke-linejoin="round" d="M 9084,26626 L 8689,26626"/>
        <path fill="rgb(0,0,0)" stroke="none" d="M 8184,26626 L 8712,26802 8712,26450 8184,26626 Z"/>
       </g>
      </g>
      <g class="Group">
       <g class="com.sun.star.drawing.CustomShape">
        <g id="id36">
         <rect class="BoundingBox" stroke="none" fill="none" x="5522" y="26405" width="837" height="1237"/>
         <path fill="none" stroke="rgb(0,0,0)" stroke-width="35" stroke-linejoin="round" d="M 5940,27623 L 5540,27623 5540,26423 6340,26423 6340,27623 5940,27623 Z"/>
        </g>
       </g>
       <g class="com.sun.star.drawing.CustomShape">
        <g id="id37">
         <rect class="BoundingBox" stroke="none" fill="none" x="6120" y="27116" width="242" height="342"/>
         <path fill="none" stroke="rgb(0,0,0)" stroke-width="40" stroke-linejoin="round" d="M 6140,27287 L 6340,27136 6340,27437 6140,27287 Z"/>
        </g>
       </g>
      </g>
      <g class="com.sun.star.drawing.LineShape">
       <g id="id38">
        <rect class="BoundingBox" stroke="none" fill="none" x="6388" y="26450" width="919" height="354"/>
        <path fill="none" stroke="rgb(0,0,0)" stroke-width="35" stroke-linejoin="round" d="M 7288,26626 L 6893,26626"/>
        <path fill="rgb(0,0,0)" stroke="none" d="M 6388,26626 L 6916,26802 6916,26450 6388,26626 Z"/>
       </g>
      </g>
      <g class="Group">
       <g class="com.sun.star.drawing.CustomShape">
        <g id="id39">
         <rect class="BoundingBox" stroke="none" fill="none" x="3726" y="26405" width="837" height="1237"/>
         <path fill="none" stroke="rgb(0,0,0)" stroke-width="35" stroke-linejoin="round" d="M 4144,27623 L 3744,27623 3744,26423 4544,26423 4544,27623 4144,27623 Z"/>
        </g>
       </g>
       <g class="com.sun.star.drawing.CustomShape">
        <g id="id40">
         <rect class="BoundingBox" stroke="none" fill="none" x="4324" y="27116" width="242" height="342"/>
         <path fill="none" stroke="rgb(0,0,0)" stroke-width="40" stroke-linejoin="round" d="M 4344,27287 L 4544,27136 4544,27437 4344,27287 Z"/>
        </g>
       </g>
      </g>
      <g class="com.sun.star.drawing.LineShape">
       <g id="id41">
        <rect class="BoundingBox" stroke="none" fill="none" x="4593" y="26450" width="919" height="354"/>
        <path fill="none" stroke="rgb(0,0,0)" stroke-width="35" stroke-linejoin="round" d="M 5493,26626 L 5098,26626"/>
        <path fill="rgb(0,0,0)" stroke="none" d="M 4593,26626 L 5121,26802 5121,26450 4593,26626 Z"/>
       </g>
      </g>
      <g class="com.sun.star.drawing.LineShape">
       <g id="id42">
        <rect class="BoundingBox" stroke="none" fill="none" x="3237" y="26608" width="437" height="37"/>
        <path fill="none" stroke="rgb(0,0,0)" stroke-width="35" stroke-linejoin="round" d="M 3655,26626 L 3255,26626"/>
       </g>
      </g>
      <g class="com.sun.star.drawing.LineShape">
       <g id="id43">
        <rect class="BoundingBox" stroke="none" fill="none" x="3250" y="24428" width="37" height="2208"/>
        <path fill="none" stroke="rgb(0,0,0)" stroke-width="35" stroke-linejoin="round" d="M 3268,24446 L 3268,26617"/>
       </g>
      </g>
      <g class="com.sun.star.drawing.LineShape">
       <g id="id44">
        <rect class="BoundingBox" stroke="none" fill="none" x="3234" y="24276" width="3234" height="353"/>
        <path fill="none" stroke="rgb(0,0,0)" stroke-width="35" stroke-linejoin="round" d="M 3252,24452 L 5962,24452"/>
        <path fill="rgb(0,0,0)" stroke="none" d="M 6467,24452 L 5939,24276 5939,24628 6467,24452 Z"/>
       </g>
      </g>
      <g class="com.sun.star.drawing.LineShape">
       <g id="id45">
        <rect class="BoundingBox" stroke="none" fill="none" x="3112" y="26505" width="354" height="1751"/>
        <path fill="none" stroke="rgb(0,0,0)" stroke-width="35" stroke-linejoin="round" d="M 3288,26740 L 3288,27750"/>
        <path fill="rgb(0,0,0)" stroke="none" d="M 3265,26754 L 3242,26748 3219,26736 3199,26720 3183,26700 3171,26677 3165,26654 3162,26631 3165,26608 3171,26584 3183,26562 3199,26542 3219,26526 3242,26515 3265,26507 3289,26505 3311,26507 3335,26515 3357,26526 3377,26542 3393,26562 3405,26584 3411,26608 3414,26631 3411,26654 3405,26677 3393,26700 3377,26720 3357,26736 3335,26748 3311,26754 3289,26757 3265,26754 Z"/>
        <path fill="rgb(0,0,0)" stroke="none" d="M 3288,28255 L 3464,27727 3112,27727 3288,28255 Z"/>
       </g>
      </g>
      <g class="OLE2">
       <g id="id46">
        <rect class="BoundingBox" stroke="none" fill="none" x="14806" y="23814" width="412" height="467"/>
        <defs>
         <clipPath id="clip_path_6" clipPathUnits="userSpaceOnUse">
          <path d="M 14817,23813 L 15214,23813 15214,24289 14817,24289 14817,23813 Z"/>
         </clipPath>
        </defs>
        <g clip-path="url(#clip_path_6)">
         <text class="TextShape"><tspan class="TextParagraph" font-family="Liberation Serif, serif" font-size="422px" font-weight="400"><tspan class="TextPosition" x="14912" y="24184"><tspan fill="rgb(0,0,0)" stroke="none">1</tspan></tspan></tspan></text>
        </g>
       </g>
      </g>
      <g class="OLE2">
       <g id="id47">
        <rect class="BoundingBox" stroke="none" fill="none" x="14806" y="24665" width="429" height="467"/>
        <defs>
         <clipPath id="clip_path_7" clipPathUnits="userSpaceOnUse">
          <path d="M 14817,24659 L 15240,24659 15240,25135 14817,25135 14817,24659 Z"/>
         </clipPath>
        </defs>
        <g clip-path="url(#clip_path_7)">
         <text class="TextShape"><tspan class="TextParagraph" font-family="Liberation Serif, serif" font-size="422px" font-weight="400"><tspan class="TextPosition" x="14912" y="25035"><tspan fill="rgb(0,0,0)" stroke="none">0</tspan></tspan></tspan></text>
        </g>
       </g>
      </g>
      <g class="com.sun.star.drawing.LineShape">
       <g id="id48">
        <rect class="BoundingBox" stroke="none" fill="none" x="15248" y="23482" width="37" height="455"/>
        <path fill="none" stroke="rgb(0,0,0)" stroke-width="35" stroke-linejoin="round" d="M 15266,23918 L 15266,23500"/>
       </g>
      </g>
      <g class="com.sun.star.drawing.LineShape">
       <g id="id49">
        <rect class="BoundingBox" stroke="none" fill="none" x="6926" y="25012" width="353" height="1751"/>
        <path fill="none" stroke="rgb(0,0,0)" stroke-width="35" stroke-linejoin="round" d="M 7102,26527 L 7102,25517"/>
        <path fill="rgb(0,0,0)" stroke="none" d="M 7125,26513 L 7148,26519 7171,26531 7191,26547 7207,26567 7219,26590 7225,26613 7228,26636 7225,26659 7219,26683 7207,26705 7191,26725 7171,26741 7148,26752 7125,26760 7101,26762 7079,26760 7055,26752 7033,26741 7013,26725 6997,26705 6985,26683 6979,26659 6976,26636 6979,26613 6985,26590 6997,26567 7013,26547 7033,26531 7055,26519 7079,26513 7101,26510 7125,26513 Z"/>
        <path fill="rgb(0,0,0)" stroke="none" d="M 7102,25012 L 6926,25540 7278,25540 7102,25012 Z"/>
       </g>
      </g>
      <g class="Group">
       <g class="com.sun.star.drawing.CustomShape">
        <g id="id50">
         <rect class="BoundingBox" stroke="none" fill="none" x="6549" y="23903" width="1042" height="1042"/>
         <path fill="none" stroke="rgb(0,0,0)" stroke-width="40" stroke-linejoin="round" d="M 7069,23923 C 7352,23923 7569,24140 7569,24423 7569,24706 7352,24923 7069,24923 6786,24923 6569,24706 6569,24423 6569,24140 6786,23923 7069,23923 Z"/>
        </g>
       </g>
       <g class="OLE2">
        <g id="id51">
         <rect class="BoundingBox" stroke="none" fill="none" x="6824" y="24325" width="491" height="234"/>
         <defs>
          <clipPath id="clip_path_8" clipPathUnits="userSpaceOnUse">
           <path d="M 6826,24315 L 7303,24315 7303,24553 6826,24553 6826,24315 Z"/>
          </clipPath>
         </defs>
         <g clip-path="url(#clip_path_8)">
          <text class="TextShape"><tspan class="TextParagraph" font-family="OpenSymbol" font-size="422px" font-weight="400"><tspan class="TextPosition" x="6930" y="24563"><tspan fill="rgb(0,0,0)" stroke="none">+</tspan></tspan></tspan></text>
         </g>
        </g>
       </g>
      </g>
      <g class="com.sun.star.drawing.LineShape">
       <g id="id52">
        <rect class="BoundingBox" stroke="none" fill="none" x="7644" y="24247" width="2469" height="353"/>
        <path fill="none" stroke="rgb(0,0,0)" stroke-width="35" stroke-linejoin="round" d="M 7662,24423 L 9607,24423"/>
        <path fill="rgb(0,0,0)" stroke="none" d="M 10112,24423 L 9584,24247 9584,24599 10112,24423 Z"/>
       </g>
      </g>
      <g class="OLE2">
       <g id="id53">
        <rect class="BoundingBox" stroke="none" fill="none" x="7532" y="25910" width="412" height="467"/>
        <defs>
         <clipPath id="clip_path_9" clipPathUnits="userSpaceOnUse">
          <path d="M 7541,25903 L 7938,25903 7938,26379 7541,26379 7541,25903 Z"/>
         </clipPath>
        </defs>
        <g clip-path="url(#clip_path_9)">
         <text class="TextShape"><tspan class="TextParagraph" font-family="Liberation Serif, serif" font-size="422px" font-style="italic" font-weight="400"><tspan class="TextPosition" x="7638" y="26280"><tspan fill="rgb(0,0,0)" stroke="none">e</tspan></tspan></tspan></text>
        </g>
       </g>
      </g>
     </g>
    </g>
   </g>
  </g>
 </g>
</svg>