<?xml version="1.0" encoding="UTF-8"?>
<!DOCTYPE svg PUBLIC "-//W3C//DTD SVG 1.1//EN" "http://www.w3.org/Graphics/SVG/1.1/DTD/svg11.dtd">
<svg version="1.2" width="112.95mm" height="35.8mm" viewBox="0 0 11295 3580" preserveAspectRatio="xMidYMid" fill-rule="evenodd" stroke-width="28.222" stroke-linejoin="round" xmlns="http://www.w3.org/2000/svg" xmlns:ooo="http://xml.openoffice.org/svg/export" xmlns:xlink="http://www.w3.org/1999/xlink" xmlns:presentation="http://sun.com/xmlns/staroffice/presentation" xmlns:smil="http://www.w3.org/2001/SMIL20/" xmlns:anim="urn:oasis:names:tc:opendocument:xmlns:animation:1.0" xml:space="preserve">
 <defs class="ClipPathGroup">
  <clipPath id="presentation_clip_path" clipPathUnits="userSpaceOnUse">
   <rect x="0" y="0" width="11295" height="3580"/>
  </clipPath>
  <clipPath id="presentation_clip_path_shrink" clipPathUnits="userSpaceOnUse">
   <rect x="11" y="3" width="11273" height="3573"/>
  </clipPath>
 </defs>
 <defs>
  <font id="EmbeddedFont_1" horiz-adv-x="2048">
   <font-face font-family="Liberation Mono embedded" units-per-em="2048" font-weight="normal" font-style="normal" ascent="1693" descent="609"/>
   <missing-glyph horiz-adv-x="2048" d="M 0,0 L 2047,0 2047,2047 0,2047 0,0 Z"/>
   <glyph unicode="y" horiz-adv-x="1112" d="M 705,0 C 680,-65 655,-124 628,-177 601,-229 572,-273 539,-311 506,-347 470,-376 430,-396 390,-415 344,-425 292,-425 269,-425 248,-424 229,-423 210,-422 189,-419 168,-414 L 168,-279 C 181,-282 195,-284 211,-284 227,-284 241,-284 252,-284 305,-284 354,-264 401,-225 447,-186 486,-124 518,-38 L 536,11 66,1082 258,1082 522,440 C 529,422 538,400 549,374 560,347 570,321 580,296 590,270 599,247 607,226 614,205 619,192 620,186 622,193 627,207 635,228 642,248 651,271 661,296 671,321 681,346 692,373 702,399 711,422 719,441 L 971,1082 1161,1082 705,0 Z"/>
   <glyph unicode="s" horiz-adv-x="900" d="M 1060,309 C 1060,258 1050,213 1031,172 1011,131 982,97 945,69 908,40 862,18 808,3 753,-12 691,-20 621,-20 558,-20 502,-15 452,-7 401,3 357,17 319,38 281,59 249,86 224,121 198,155 179,197 167,248 L 326,279 C 334,242 347,213 365,192 382,170 404,153 429,142 454,131 482,123 515,120 548,116 583,114 621,114 660,114 696,117 729,123 762,128 790,138 814,152 838,165 857,183 871,205 884,226 891,253 891,285 891,318 883,345 866,366 849,386 825,403 796,417 767,431 732,443 692,453 651,463 607,474 560,487 517,498 475,511 433,524 391,537 354,555 321,577 288,598 261,626 241,659 220,692 210,735 210,786 210,884 245,961 316,1016 387,1071 489,1099 623,1099 676,1099 725,1094 771,1085 817,1075 858,1060 894,1039 930,1018 960,991 985,958 1009,925 1026,885 1035,839 L 873,819 C 868,849 858,873 843,892 828,911 809,926 787,937 764,948 739,955 711,959 683,963 654,965 623,965 460,965 378,915 378,814 378,783 385,759 400,740 414,721 434,705 460,692 486,679 517,669 553,660 589,651 629,640 672,629 715,618 760,606 806,592 851,578 893,559 931,536 968,513 999,483 1024,447 1048,410 1060,364 1060,309 Z"/>
   <glyph unicode="r" horiz-adv-x="821" d="M 1045,918 C 1014,923 981,928 947,932 912,935 874,937 833,937 777,937 727,926 682,903 637,880 600,850 569,811 538,772 515,726 499,674 482,622 474,567 474,508 L 474,0 294,0 294,701 C 294,738 292,776 288,815 284,854 279,890 274,925 269,959 263,990 257,1017 251,1044 246,1066 242,1082 L 413,1082 C 418,1066 423,1048 428,1027 433,1006 437,985 442,963 447,940 451,918 454,895 457,872 460,851 461,832 L 466,832 C 485,873 504,911 525,944 546,977 570,1006 599,1029 627,1052 660,1070 699,1083 738,1096 784,1102 839,1102 876,1102 913,1100 949,1097 985,1094 1017,1090 1045,1085 L 1045,918 Z"/>
   <glyph unicode="p" horiz-adv-x="927" d="M 1090,546 C 1090,464 1083,388 1070,319 1057,250 1035,190 1004,140 973,90 933,51 883,23 833,-6 771,-20 698,-20 661,-20 626,-17 593,-10 560,-3 529,7 500,22 471,37 446,56 424,79 401,102 382,131 367,164 L 362,164 C 363,163 363,157 364,147 364,136 364,123 365,108 365,93 365,75 366,56 366,37 366,17 366,-2 L 366,-425 185,-425 185,858 C 185,885 185,910 185,935 184,960 184,982 183,1002 182,1021 182,1038 181,1052 180,1066 180,1076 179,1082 L 354,1082 C 355,1080 356,1073 357,1061 358,1048 359,1033 360,1016 361,999 362,980 363,960 364,940 364,921 364,904 L 368,904 C 385,939 404,969 425,994 446,1019 469,1040 496,1057 523,1073 553,1085 586,1093 619,1100 657,1104 698,1104 771,1104 833,1091 883,1064 933,1037 973,1000 1004,951 1035,902 1057,843 1070,774 1083,705 1090,629 1090,546 Z M 904,546 C 904,613 900,672 892,724 884,776 870,820 851,856 831,891 805,918 773,937 740,956 700,965 651,965 612,965 575,959 540,947 505,934 475,912 450,880 424,847 404,802 389,745 374,688 366,614 366,524 366,447 372,383 385,331 397,278 415,236 439,204 463,171 493,148 528,134 563,120 604,113 649,113 698,113 738,123 771,142 804,161 830,188 850,225 869,262 883,307 892,361 900,415 904,477 904,546 Z"/>
   <glyph unicode="o" horiz-adv-x="1006" d="M 1097,542 C 1097,447 1086,365 1064,295 1041,224 1009,166 967,119 925,72 874,38 814,15 753,-8 685,-20 609,-20 536,-20 471,-9 412,14 353,37 302,71 261,118 219,165 187,223 164,294 141,364 130,447 130,542 130,728 172,868 257,962 341,1055 460,1102 615,1102 778,1102 899,1056 978,963 1057,870 1097,730 1097,542 Z M 908,542 C 908,626 901,695 887,750 872,805 852,848 827,881 801,914 770,937 735,950 700,963 661,969 618,969 575,969 535,962 498,949 461,935 430,912 404,879 377,846 357,802 342,747 327,692 319,624 319,542 319,458 327,389 343,334 358,279 379,235 406,202 432,169 463,146 498,133 533,120 569,113 607,113 650,113 691,120 728,133 765,146 796,168 823,201 850,234 871,278 886,333 901,388 908,458 908,542 Z"/>
   <glyph unicode="m" horiz-adv-x="1060" d="M 531,0 L 531,686 C 531,739 529,783 525,818 521,853 515,882 506,904 497,925 485,941 471,950 456,959 438,963 417,963 395,963 375,955 358,938 341,921 326,897 313,866 300,835 291,797 284,754 277,710 274,661 274,607 L 274,0 105,0 105,851 C 105,874 105,898 105,923 104,948 104,971 103,994 102,1016 102,1035 101,1051 100,1067 100,1077 99,1082 L 248,1082 C 249,1079 249,1070 250,1057 251,1043 251,1027 252,1010 253,992 253,974 254,955 254,936 254,920 254,907 L 256,907 C 265,933 275,958 287,982 299,1005 314,1026 331,1044 348,1062 368,1076 391,1087 414,1097 441,1102 472,1102 531,1102 575,1086 604,1054 633,1022 653,973 666,906 L 668,906 C 680,937 693,965 708,990 722,1014 738,1034 757,1051 776,1068 797,1080 821,1089 845,1098 873,1102 904,1102 945,1102 979,1095 1007,1080 1035,1065 1058,1043 1075,1012 1092,981 1105,942 1113,894 1120,846 1124,788 1124,721 L 1124,0 956,0 956,686 C 956,739 954,783 950,818 946,853 940,882 931,904 922,925 910,941 896,950 881,959 863,963 842,963 798,963 763,935 738,879 712,823 699,739 699,627 L 699,0 531,0 Z"/>
   <glyph unicode="l" horiz-adv-x="980" d="M 736,142 L 1116,142 1116,0 134,0 134,142 556,142 556,1342 267,1342 267,1484 736,1484 736,142 Z"/>
   <glyph unicode="k" horiz-adv-x="927" d="M 914,0 L 548,499 416,401 416,0 236,0 236,1484 416,1484 416,557 891,1082 1102,1082 663,617 1125,0 914,0 Z"/>
   <glyph unicode="e" horiz-adv-x="980" d="M 322,503 C 322,446 328,394 341,347 354,299 373,258 398,224 423,189 455,163 493,144 530,125 574,115 623,115 660,115 694,119 725,128 756,136 783,147 808,162 833,177 853,194 870,215 887,235 899,257 907,281 L 1065,236 C 1054,206 1038,176 1017,146 996,115 967,88 932,64 897,39 854,19 803,4 752,-12 692,-20 623,-20 546,-20 478,-8 417,16 356,40 305,76 263,123 221,170 189,230 167,301 144,372 133,454 133,548 133,652 146,739 173,810 199,881 234,938 279,981 324,1024 375,1055 434,1074 492,1093 553,1102 617,1102 704,1102 778,1088 839,1060 899,1032 948,993 986,943 1024,892 1052,832 1069,761 1086,690 1094,612 1094,527 L 1094,503 322,503 Z M 619,969 C 588,969 556,964 523,955 489,945 458,928 429,903 400,878 376,845 357,803 337,760 326,706 324,641 L 908,641 C 903,704 891,756 874,798 857,840 835,874 810,899 784,924 755,942 722,953 689,964 655,969 619,969 Z"/>
   <glyph unicode="c" horiz-adv-x="980" d="M 130,542 C 130,651 144,741 173,813 202,885 240,942 287,985 334,1028 387,1058 447,1076 507,1093 569,1102 632,1102 697,1102 756,1094 807,1077 858,1060 903,1038 940,1009 977,980 1007,945 1030,906 1053,867 1069,824 1078,779 L 886,765 C 875,826 849,874 806,909 763,944 703,961 624,961 567,961 519,952 480,934 441,915 409,889 386,854 362,819 345,775 335,724 324,672 319,613 319,546 319,479 324,420 335,367 345,314 362,269 386,232 409,195 441,167 480,148 519,129 566,119 623,119 695,119 755,137 802,172 849,207 879,261 890,334 L 1080,322 C 1074,277 1060,234 1037,193 1014,152 984,115 946,84 908,53 863,28 810,9 757,-10 698,-20 631,-20 540,-20 462,-6 399,23 335,52 283,91 244,142 204,192 175,251 157,320 139,388 130,462 130,542 Z"/>
   <glyph unicode="b" horiz-adv-x="927" d="M 1090,546 C 1090,357 1056,215 989,121 921,27 824,-20 698,-20 621,-20 554,-6 497,23 440,52 396,99 364,164 L 362,164 C 362,147 362,129 361,111 360,92 360,75 359,60 358,45 357,32 356,21 355,10 354,3 353,0 L 179,0 C 180,6 180,16 181,31 182,45 182,62 183,82 184,102 184,124 185,148 185,172 185,197 185,223 L 185,1484 365,1484 365,1061 C 365,1042 365,1023 365,1004 364,985 364,968 363,953 362,936 362,919 361,904 L 365,904 C 397,974 441,1025 498,1057 554,1088 621,1104 699,1104 829,1104 927,1058 992,966 1057,873 1090,733 1090,546 Z M 904,540 C 904,615 899,679 889,733 879,786 864,830 843,865 822,899 795,924 764,941 732,957 694,965 650,965 606,965 566,958 531,943 496,928 466,903 442,869 417,834 398,789 385,733 372,676 365,607 365,524 365,445 372,379 385,326 398,273 417,231 442,200 466,168 496,146 531,133 566,120 605,113 648,113 690,113 727,121 759,136 791,151 818,176 839,210 860,244 877,288 888,343 899,397 904,463 904,540 Z"/>
   <glyph unicode="a" horiz-adv-x="1059" d="M 1101,111 C 1111,111 1121,112 1131,113 1141,114 1151,116 1160,118 L 1160,6 C 1137,1 1115,-3 1093,-6 1070,-9 1046,-10 1021,-10 987,-10 958,-5 934,4 909,13 889,26 874,45 859,63 847,86 839,113 831,140 826,171 824,207 L 818,207 C 799,172 779,141 756,113 733,85 707,61 678,42 649,22 615,7 577,-4 539,-15 495,-20 446,-20 341,-20 261,9 208,66 155,123 128,202 128,302 128,373 141,432 168,478 194,523 228,559 271,585 314,611 362,629 417,640 471,650 526,655 582,656 L 818,660 818,719 C 818,764 814,802 805,833 796,864 782,890 764,909 745,928 722,943 694,952 666,961 633,965 596,965 563,965 533,963 506,958 479,953 455,944 436,931 417,918 401,900 389,878 376,855 368,827 364,793 L 176,810 C 183,853 195,892 214,928 232,963 258,994 291,1020 324,1046 366,1066 417,1081 467,1095 528,1102 599,1102 732,1102 833,1071 900,1009 967,946 1000,856 1000,738 L 1000,272 C 1000,219 1007,179 1021,152 1035,125 1062,111 1101,111 Z M 492,117 C 547,117 595,128 636,149 677,170 711,196 738,228 765,260 785,295 798,334 811,373 818,410 818,445 L 818,534 628,530 C 591,529 555,527 518,522 481,517 447,506 418,490 388,474 364,451 345,421 326,390 317,350 317,299 317,244 332,200 362,167 391,134 435,117 492,117 Z"/>
   <glyph unicode="_" horiz-adv-x="1271" d="M -5,-220 L -5,-124 1233,-124 1233,-220 -5,-220 Z"/>
  </font>
 </defs>
 <defs>
  <font id="EmbeddedFont_2" horiz-adv-x="2048">
   <font-face font-family="Liberation Sans embedded" units-per-em="2048" font-weight="normal" font-style="normal" ascent="1826" descent="423"/>
   <missing-glyph horiz-adv-x="2048" d="M 0,0 L 2047,0 2047,2047 0,2047 0,0 Z"/>
   <glyph unicode="u" horiz-adv-x="874" d="M 314,1082 L 314,396 C 314,343 318,299 326,264 333,229 346,200 363,179 380,157 403,142 432,133 460,124 495,119 537,119 580,119 618,127 653,142 687,157 716,178 741,207 765,235 784,270 797,312 810,353 817,401 817,455 L 817,1082 997,1082 997,231 C 997,208 997,185 998,160 998,135 998,111 999,89 1000,66 1000,47 1001,31 1002,15 1002,5 1003,0 L 833,0 C 832,3 832,12 831,27 830,42 830,59 829,78 828,97 827,116 826,136 825,155 825,172 825,185 L 822,185 C 805,154 786,125 765,100 744,75 720,53 693,36 666,18 634,4 599,-6 564,-15 523,-20 476,-20 416,-20 364,-13 321,2 278,17 242,39 214,70 186,101 166,140 153,188 140,236 133,294 133,361 L 133,1082 314,1082 Z"/>
   <glyph unicode="t" horiz-adv-x="531" d="M 554,8 C 527,1 499,-5 471,-10 442,-14 409,-16 372,-16 228,-16 156,66 156,229 L 156,951 31,951 31,1082 163,1082 216,1324 336,1324 336,1082 536,1082 536,951 336,951 336,268 C 336,216 345,180 362,159 379,138 408,127 450,127 467,127 484,128 501,131 517,134 535,137 554,141 L 554,8 Z"/>
   <glyph unicode="s" horiz-adv-x="901" d="M 950,299 C 950,248 940,203 921,164 901,124 872,91 835,64 798,37 752,16 698,2 643,-13 581,-20 511,-20 448,-20 392,-15 342,-6 291,4 247,20 209,41 171,62 139,91 114,126 88,161 69,203 57,254 L 216,285 C 231,227 263,185 311,158 359,131 426,117 511,117 550,117 585,120 618,125 650,130 678,140 701,153 724,166 743,183 756,205 769,226 775,253 775,285 775,318 767,345 752,366 737,387 715,404 688,418 661,432 628,444 589,455 550,465 507,476 460,489 417,500 374,513 331,527 288,541 250,560 216,583 181,606 153,634 132,668 111,702 100,745 100,796 100,895 135,970 206,1022 276,1073 378,1099 513,1099 632,1099 727,1078 798,1036 868,994 912,927 931,834 L 769,814 C 763,842 752,866 736,885 720,904 701,919 678,931 655,942 630,951 602,956 573,961 544,963 513,963 432,963 372,951 333,926 294,901 275,864 275,814 275,785 282,761 297,742 311,723 331,707 357,694 382,681 413,669 449,660 485,650 525,640 568,629 597,622 626,614 656,606 686,597 715,587 744,576 772,564 799,550 824,535 849,519 870,500 889,478 908,456 923,430 934,401 945,372 950,338 950,299 Z"/>
   <glyph unicode="p" horiz-adv-x="953" d="M 1053,546 C 1053,464 1046,388 1033,319 1020,250 998,190 967,140 936,90 895,51 844,23 793,-6 730,-20 655,-20 578,-20 510,-5 452,24 394,53 350,101 319,168 L 314,168 C 315,167 315,161 316,150 316,139 316,126 317,110 317,94 317,76 318,57 318,37 318,17 318,-2 L 318,-425 138,-425 138,861 C 138,887 138,912 138,936 137,960 137,982 136,1002 135,1021 135,1038 134,1052 133,1066 133,1076 132,1082 L 306,1082 C 307,1080 308,1073 309,1061 310,1049 311,1035 312,1018 313,1001 314,982 315,963 316,944 316,925 316,908 L 320,908 C 337,943 356,972 377,997 398,1021 423,1041 450,1057 477,1072 508,1084 542,1091 575,1098 613,1101 655,1101 730,1101 793,1088 844,1061 895,1034 936,997 967,949 998,900 1020,842 1033,774 1046,705 1053,629 1053,546 Z M 864,542 C 864,609 860,668 852,720 844,772 830,816 811,852 791,888 765,915 732,934 699,953 658,962 609,962 569,962 531,956 496,945 461,934 430,912 404,880 377,848 356,804 341,748 326,691 318,618 318,528 318,451 324,387 337,334 350,281 368,238 393,205 417,172 447,149 483,135 519,120 560,113 607,113 657,113 699,123 732,142 765,161 791,189 811,226 830,263 844,308 852,361 860,414 864,474 864,542 Z"/>
   <glyph unicode="o" horiz-adv-x="980" d="M 1053,542 C 1053,353 1011,212 928,119 845,26 724,-20 565,-20 490,-20 422,-9 363,14 304,37 254,71 213,118 172,165 140,223 119,294 97,364 86,447 86,542 86,915 248,1102 571,1102 655,1102 728,1090 789,1067 850,1044 900,1009 939,962 978,915 1006,857 1025,787 1044,717 1053,635 1053,542 Z M 864,542 C 864,626 858,695 845,750 832,805 813,848 788,881 763,914 732,937 696,950 660,963 619,969 574,969 528,969 487,962 450,949 413,935 381,912 355,879 329,846 309,802 296,747 282,692 275,624 275,542 275,458 282,389 297,334 312,279 332,235 358,202 383,169 414,146 449,133 484,120 522,113 563,113 609,113 651,120 688,133 725,146 757,168 783,201 809,234 829,278 843,333 857,388 864,458 864,542 Z"/>
   <glyph unicode="n" horiz-adv-x="874" d="M 825,0 L 825,686 C 825,739 821,783 814,818 806,853 793,882 776,904 759,925 736,941 708,950 679,959 644,963 602,963 559,963 521,956 487,941 452,926 423,904 399,876 374,847 355,812 342,771 329,729 322,681 322,627 L 322,0 142,0 142,851 C 142,874 142,898 142,923 141,948 141,971 140,994 139,1016 139,1035 138,1051 137,1067 137,1077 136,1082 L 306,1082 C 307,1079 307,1070 308,1055 309,1040 310,1024 311,1005 312,986 312,966 313,947 314,927 314,910 314,897 L 317,897 C 334,928 353,957 374,982 395,1007 419,1029 446,1047 473,1064 505,1078 540,1088 575,1097 616,1102 663,1102 723,1102 775,1095 818,1080 861,1065 897,1043 925,1012 953,981 974,942 987,894 1000,845 1006,788 1006,721 L 1006,0 825,0 Z"/>
   <glyph unicode="l" horiz-adv-x="187" d="M 138,0 L 138,1484 318,1484 318,0 138,0 Z"/>
   <glyph unicode="i" horiz-adv-x="187" d="M 137,1312 L 137,1484 317,1484 317,1312 137,1312 Z M 137,0 L 137,1082 317,1082 317,0 137,0 Z"/>
   <glyph unicode="e" horiz-adv-x="980" d="M 276,503 C 276,446 282,394 294,347 305,299 323,258 348,224 372,189 403,163 441,144 479,125 525,115 578,115 656,115 719,131 766,162 813,193 844,233 861,281 L 1019,236 C 1008,206 992,176 972,146 951,115 924,88 890,64 856,39 814,19 763,4 712,-12 650,-20 578,-20 418,-20 296,28 213,123 129,218 87,360 87,548 87,649 100,735 125,806 150,876 185,933 229,977 273,1021 324,1053 383,1073 442,1092 504,1102 571,1102 662,1102 738,1087 799,1058 860,1029 909,988 946,937 983,885 1009,824 1025,754 1040,684 1048,608 1048,527 L 1048,503 276,503 Z M 862,641 C 852,755 823,838 775,891 727,943 658,969 568,969 538,969 507,964 474,955 441,945 410,928 382,903 354,878 330,845 311,803 292,760 281,706 278,641 L 862,641 Z"/>
   <glyph unicode="c" horiz-adv-x="901" d="M 275,546 C 275,484 280,427 289,375 298,323 313,278 334,241 355,203 384,174 419,153 454,132 497,122 548,122 612,122 666,139 709,174 752,209 778,262 788,334 L 970,322 C 964,277 951,234 931,193 911,152 884,115 850,84 815,53 773,28 724,9 675,-10 618,-20 553,-20 468,-20 396,-6 337,23 278,52 230,91 193,142 156,192 129,251 112,320 95,388 87,462 87,542 87,615 93,679 105,735 117,790 134,839 156,881 177,922 203,957 232,986 261,1014 293,1037 328,1054 362,1071 398,1083 436,1091 474,1098 512,1102 551,1102 612,1102 666,1094 713,1077 760,1060 801,1038 836,1009 870,980 898,945 919,906 940,867 955,824 964,779 L 779,765 C 770,825 746,873 708,908 670,943 616,961 546,961 495,961 452,953 418,936 383,919 355,893 334,859 313,824 298,781 289,729 280,677 275,616 275,546 Z"/>
   <glyph unicode="_" horiz-adv-x="1218" d="M -31,-407 L -31,-277 1162,-277 1162,-407 -31,-407 Z"/>
   <glyph unicode="2" horiz-adv-x="954" d="M 103,0 L 103,127 C 137,205 179,274 228,334 277,393 328,447 382,496 436,544 490,589 543,630 596,671 643,713 686,754 729,795 763,839 790,884 816,929 829,981 829,1038 829,1078 823,1113 811,1144 799,1174 782,1199 759,1220 736,1241 709,1256 678,1267 646,1277 611,1282 572,1282 536,1282 502,1277 471,1267 439,1257 411,1242 386,1222 361,1202 341,1177 326,1148 310,1118 300,1083 295,1044 L 111,1061 C 117,1112 131,1159 153,1204 175,1249 205,1288 244,1322 283,1355 329,1382 384,1401 438,1420 501,1430 572,1430 642,1430 704,1422 759,1405 814,1388 860,1364 898,1331 935,1298 964,1258 984,1210 1004,1162 1014,1107 1014,1044 1014,997 1006,952 989,909 972,866 949,826 921,787 892,748 859,711 822,675 785,639 746,604 705,570 664,535 623,501 582,468 541,434 502,400 466,366 429,332 397,298 368,263 339,228 317,191 301,153 L 1036,153 1036,0 103,0 Z"/>
   <glyph unicode="1" horiz-adv-x="927" d="M 156,0 L 156,153 515,153 515,1237 197,1010 197,1180 530,1409 696,1409 696,153 1039,153 1039,0 156,0 Z"/>
   <glyph unicode="0" horiz-adv-x="980" d="M 1059,705 C 1059,570 1046,456 1021,364 995,271 960,197 916,140 871,83 819,42 759,17 699,-8 635,-20 567,-20 498,-20 434,-8 375,17 316,42 264,82 221,139 177,196 143,270 118,363 93,455 80,569 80,705 80,847 93,965 118,1058 143,1151 177,1225 221,1280 265,1335 317,1374 377,1397 437,1419 502,1430 573,1430 640,1430 704,1419 763,1397 822,1374 873,1335 917,1280 961,1225 996,1151 1021,1058 1046,965 1059,847 1059,705 Z M 876,705 C 876,817 869,910 856,985 843,1059 823,1118 797,1163 771,1207 739,1238 702,1257 664,1275 621,1284 573,1284 522,1284 478,1275 439,1256 400,1237 368,1206 342,1162 315,1117 295,1058 282,984 269,909 262,816 262,705 262,597 269,506 283,432 296,358 316,299 343,254 369,209 401,176 439,157 477,137 520,127 569,127 616,127 659,137 697,157 735,176 767,209 794,254 820,299 840,358 855,432 869,506 876,597 876,705 Z"/>
  </font>
 </defs>
 <defs>
  <font id="EmbeddedFont_3" horiz-adv-x="2048">
   <font-face font-family="Liberation Serif embedded" units-per-em="2048" font-weight="normal" font-style="normal" ascent="1799" descent="423"/>
   <missing-glyph horiz-adv-x="2048" d="M 0,0 L 2047,0 2047,2047 0,2047 0,0 Z"/>
   <glyph unicode="1" horiz-adv-x="742" d="M 627,80 L 901,53 901,0 180,0 180,53 455,80 455,1174 184,1077 184,1130 575,1352 627,1352 627,80 Z"/>
   <glyph unicode="0" horiz-adv-x="901" d="M 946,676 C 946,564 937,465 920,378 902,291 875,219 839,160 803,101 757,56 702,26 647,-5 581,-20 506,-20 365,-20 258,39 186,158 114,277 78,449 78,676 78,898 114,1068 186,1186 258,1303 367,1362 514,1362 655,1362 763,1304 836,1188 909,1071 946,901 946,676 Z M 762,676 C 762,772 758,858 750,933 741,1008 727,1072 708,1124 688,1175 662,1215 629,1242 596,1269 555,1282 506,1282 457,1282 416,1269 385,1242 353,1215 328,1175 310,1124 292,1072 280,1008 273,933 266,858 262,772 262,676 262,580 266,494 273,418 280,341 292,277 310,224 328,171 353,130 385,102 416,73 457,59 506,59 555,59 596,73 629,102 662,130 688,171 708,224 727,277 741,341 750,418 758,494 762,580 762,676 Z"/>
  </font>
 </defs>
 <defs>
  <font id="EmbeddedFont_4" horiz-adv-x="2048">
   <font-face font-family="Liberation Serif embedded" units-per-em="2048" font-weight="normal" font-style="italic" ascent="1799" descent="423"/>
   <missing-glyph horiz-adv-x="2048" d="M 0,0 L 2047,0 2047,2047 0,2047 0,0 Z"/>
   <glyph unicode="y" horiz-adv-x="1112" d="M 52,940 L 308,940 453,208 688,614 C 710,653 726,688 737,721 747,753 752,782 752,807 752,832 745,851 731,866 717,881 702,890 686,895 L 694,940 884,940 C 890,935 896,926 902,915 907,904 910,891 910,877 910,856 904,828 893,793 882,758 860,713 827,657 L 431,-9 C 392,-76 355,-136 320,-189 285,-242 250,-288 215,-325 180,-362 143,-391 105,-411 66,-431 24,-441 -22,-441 -39,-441 -54,-441 -68,-441 -80,-441 -92,-440 -104,-438 -114,-437 -125,-435 -136,-433 -147,-430 -158,-428 -171,-424 L -134,-221 -89,-221 -73,-317 C -56,-332 -29,-340 9,-340 38,-340 66,-332 93,-315 120,-298 145,-277 170,-251 194,-224 217,-195 238,-163 259,-131 277,-100 294,-70 L 339,12 156,870 44,895 52,940 Z"/>
   <glyph unicode="x" horiz-adv-x="927" d="M 248,236 C 227,215 209,197 196,182 182,167 171,153 163,142 155,130 150,119 147,110 144,101 142,92 142,84 142,73 146,65 154,59 161,53 171,48 184,45 L 176,0 -9,0 C -13,3 -17,9 -20,17 -23,24 -25,33 -25,43 -25,52 -22,63 -18,74 -12,85 -5,97 6,111 17,125 31,141 48,159 65,177 87,198 112,221 L 385,475 213,870 106,895 114,940 362,940 507,582 631,700 C 674,741 704,773 721,796 738,819 747,839 747,856 747,861 745,866 742,870 738,874 733,878 727,881 721,884 715,886 708,889 701,891 694,893 688,895 L 696,940 873,940 C 879,935 884,930 888,923 892,916 894,907 894,897 894,858 848,794 756,707 L 542,506 734,66 850,45 842,0 586,0 419,400 248,236 Z"/>
   <glyph unicode="n" horiz-adv-x="901" d="M 755,748 C 755,778 747,802 731,821 715,840 690,849 655,849 627,849 598,843 569,830 540,817 511,800 484,779 457,758 431,735 408,709 385,682 365,656 349,630 L 239,0 73,0 226,871 108,896 116,941 394,941 367,749 C 392,782 419,811 447,838 474,865 503,887 533,906 562,925 593,939 624,950 655,960 686,965 718,965 749,965 777,961 802,953 827,945 848,932 866,915 883,898 897,876 907,849 916,822 921,791 921,754 921,746 920,735 919,722 917,708 915,693 912,677 909,661 907,645 904,628 901,611 899,595 896,580 L 808,69 939,45 931,0 630,0 732,582 C 735,597 737,612 740,628 743,644 745,660 748,675 750,690 752,704 753,717 754,730 755,740 755,748 Z"/>
  </font>
 </defs>
 <defs>
  <font id="EmbeddedFont_5" horiz-adv-x="2048">
   <font-face font-family="OpenSymbol embedded" units-per-em="2048" font-weight="normal" font-style="normal" ascent="1402" descent="423"/>
   <missing-glyph horiz-adv-x="2048" d="M 0,0 L 2047,0 2047,2047 0,2047 0,0 Z"/>
   <glyph unicode="]" horiz-adv-x="398" d="M 428,-403 L 74,-403 74,-330 330,-330 330,1553 74,1553 74,1622 428,1622 428,-403 Z"/>
   <glyph unicode="[" horiz-adv-x="372" d="M 150,-403 L 150,1622 504,1622 504,1552 248,1552 248,-332 504,-332 504,-403 150,-403 Z"/>
  </font>
 </defs>
 <defs class="TextShapeIndex">
  <g ooo:slide="id1" ooo:id-list="id3 id4 id5 id6 id7 id8 id9 id10 id11 id12 id13 id14 id15 id16 id17 id18 id19 id20 id21 id22 id23 id24 id25 id26 id27 id28 id29 id30 id31 id32 id33 id34 id35 id36 id37 id38 id39 id40 id41 id42 id43 id44 id45 id46 id47 id48 id49 id50 id51 id52 id53 id54 id55 id56 id57 id58 id59 id60 id61 id62 id63 id64 id65 id66 id67 id68 id69 id70 id71 id72 id73 id74 id75 id76 id77 id78 id79"/>
 </defs>
 <defs class="EmbeddedBulletChars">
  <g id="bullet-char-template(57356)" transform="scale(0.00048828125,-0.00048828125)">
   <path d="M 580,1141 L 1163,571 580,0 -4,571 580,1141 Z"/>
  </g>
  <g id="bullet-char-template(57354)" transform="scale(0.00048828125,-0.00048828125)">
   <path d="M 8,1128 L 1137,1128 1137,0 8,0 8,1128 Z"/>
  </g>
  <g id="bullet-char-template(10146)" transform="scale(0.00048828125,-0.00048828125)">
   <path d="M 174,0 L 602,739 174,1481 1456,739 174,0 Z M 1358,739 L 309,1346 659,739 1358,739 Z"/>
  </g>
  <g id="bullet-char-template(10132)" transform="scale(0.00048828125,-0.00048828125)">
   <path d="M 2015,739 L 1276,0 717,0 1260,543 174,543 174,936 1260,936 717,1481 1274,1481 2015,739 Z"/>
  </g>
  <g id="bullet-char-template(10007)" transform="scale(0.00048828125,-0.00048828125)">
   <path d="M 0,-2 C -7,14 -16,27 -25,37 L 356,567 C 262,823 215,952 215,954 215,979 228,992 255,992 264,992 276,990 289,987 310,991 331,999 354,1012 L 381,999 492,748 772,1049 836,1024 860,1049 C 881,1039 901,1025 922,1006 886,937 835,863 770,784 769,783 710,716 594,584 L 774,223 C 774,196 753,168 711,139 L 727,119 C 717,90 699,76 672,76 641,76 570,178 457,381 L 164,-76 C 142,-110 111,-127 72,-127 30,-127 9,-110 8,-76 1,-67 -2,-52 -2,-32 -2,-23 -1,-13 0,-2 Z"/>
  </g>
  <g id="bullet-char-template(10004)" transform="scale(0.00048828125,-0.00048828125)">
   <path d="M 285,-33 C 182,-33 111,30 74,156 52,228 41,333 41,471 41,549 55,616 82,672 116,743 169,778 240,778 293,778 328,747 346,684 L 369,508 C 377,444 397,411 428,410 L 1163,1116 C 1174,1127 1196,1133 1229,1133 1271,1133 1292,1118 1292,1087 L 1292,965 C 1292,929 1282,901 1262,881 L 442,47 C 390,-6 338,-33 285,-33 Z"/>
  </g>
  <g id="bullet-char-template(9679)" transform="scale(0.00048828125,-0.00048828125)">
   <path d="M 813,0 C 632,0 489,54 383,161 276,268 223,411 223,592 223,773 276,916 383,1023 489,1130 632,1184 813,1184 992,1184 1136,1130 1245,1023 1353,916 1407,772 1407,592 1407,412 1353,268 1245,161 1136,54 992,0 813,0 Z"/>
  </g>
  <g id="bullet-char-template(8226)" transform="scale(0.00048828125,-0.00048828125)">
   <path d="M 346,457 C 273,457 209,483 155,535 101,586 74,649 74,723 74,796 101,859 155,911 209,963 273,989 346,989 419,989 480,963 531,910 582,859 608,796 608,723 608,648 583,586 532,535 482,483 420,457 346,457 Z"/>
  </g>
  <g id="bullet-char-template(8211)" transform="scale(0.00048828125,-0.00048828125)">
   <path d="M -4,459 L 1135,459 1135,606 -4,606 -4,459 Z"/>
  </g>
  <g id="bullet-char-template(61548)" transform="scale(0.00048828125,-0.00048828125)">
   <path d="M 173,740 C 173,903 231,1043 346,1159 462,1274 601,1332 765,1332 928,1332 1067,1274 1183,1159 1299,1043 1357,903 1357,740 1357,577 1299,437 1183,322 1067,206 928,148 765,148 601,148 462,206 346,322 231,437 173,577 173,740 Z"/>
  </g>
 </defs>
 <defs class="TextEmbeddedBitmaps"/>
 <g>
  <g id="id2" class="Master_Slide">
   <g id="bg-id2" class="Background"/>
   <g id="bo-id2" class="BackgroundObjects"/>
  </g>
 </g>
 <g class="SlideGroup">
  <g>
   <g id="container-id1">
    <g id="id1" class="Slide" clip-path="url(#presentation_clip_path)">
     <g class="Page">
      <g class="com.sun.star.drawing.PolyPolygonShape">
       <g id="id3">
        <rect class="BoundingBox" stroke="none" fill="none" x="7647" y="215" width="1048" height="1548"/>
       </g>
      </g>
      <g class="com.sun.star.drawing.PolyPolygonShape">
       <g id="id4">
        <rect class="BoundingBox" stroke="none" fill="none" x="7644" y="1104" width="306" height="429"/>
       </g>
      </g>
      <g class="com.sun.star.drawing.PolyPolygonShape">
       <g id="id5">
        <rect class="BoundingBox" stroke="none" fill="none" x="6314" y="767" width="1276" height="443"/>
       </g>
      </g>
      <g class="com.sun.star.drawing.LineShape">
       <g id="id6">
        <rect class="BoundingBox" stroke="none" fill="none" x="6314" y="966" width="664" height="45"/>
        <path fill="none" stroke="rgb(0,0,0)" stroke-width="44" stroke-linejoin="round" d="M 6336,988 L 6955,988"/>
       </g>
      </g>
      <g class="com.sun.star.drawing.PolyPolygonShape">
       <g id="id7">
        <rect class="BoundingBox" stroke="none" fill="none" x="6926" y="767" width="663" height="442"/>
        <path fill="rgb(0,0,0)" stroke="none" d="M 7587,988 L 6926,767 6926,1208 7587,988 Z"/>
       </g>
      </g>
      <g class="com.sun.star.drawing.PolyPolygonShape">
       <g id="id8">
        <rect class="BoundingBox" stroke="none" fill="none" x="8771" y="767" width="1276" height="443"/>
       </g>
      </g>
      <g class="com.sun.star.drawing.PolyPolygonShape">
       <g id="id9">
        <rect class="BoundingBox" stroke="none" fill="none" x="5695" y="1677" width="446" height="1277"/>
       </g>
      </g>
      <g class="com.sun.star.drawing.LineShape">
       <g id="id10">
        <rect class="BoundingBox" stroke="none" fill="none" x="5893" y="2288" width="45" height="664"/>
        <path fill="none" stroke="rgb(0,0,0)" stroke-width="44" stroke-linejoin="round" d="M 5915,2929 L 5915,2310"/>
       </g>
      </g>
      <g class="com.sun.star.drawing.PolyPolygonShape">
       <g id="id11">
        <rect class="BoundingBox" stroke="none" fill="none" x="5695" y="1679" width="442" height="662"/>
        <path fill="rgb(0,0,0)" stroke="none" d="M 5915,1679 L 5695,2340 6136,2340 5915,1679 Z"/>
       </g>
      </g>
      <g class="com.sun.star.drawing.PolyPolygonShape">
       <g id="id12">
        <rect class="BoundingBox" stroke="none" fill="none" x="5296" y="2980" width="1242" height="603"/>
       </g>
      </g>
      <g class="com.sun.star.drawing.PolyPolygonShape">
       <g id="id13">
        <rect class="BoundingBox" stroke="none" fill="none" x="10012" y="688" width="1287" height="603"/>
       </g>
      </g>
      <g class="com.sun.star.drawing.PolyPolygonShape">
       <g id="id14">
        <rect class="BoundingBox" stroke="none" fill="none" x="5200" y="25" width="1086" height="1929"/>
       </g>
      </g>
      <g class="com.sun.star.drawing.PolyPolygonShape">
       <g id="id15">
        <rect class="BoundingBox" stroke="none" fill="none" x="5201" y="25" width="1082" height="1927"/>
        <path fill="none" stroke="rgb(0,0,0)" stroke-width="50" stroke-linejoin="round" d="M 5226,50 L 5226,1926 6257,1457 6257,519 5226,50 Z"/>
       </g>
      </g>
      <g class="com.sun.star.drawing.PolyPolygonShape">
       <g id="id16">
        <rect class="BoundingBox" stroke="none" fill="none" x="5195" y="1204" width="517" height="586"/>
       </g>
      </g>
      <g class="com.sun.star.drawing.PolyPolygonShape">
       <g id="id17">
        <rect class="BoundingBox" stroke="none" fill="none" x="5195" y="140" width="538" height="586"/>
       </g>
      </g>
      <g class="com.sun.star.drawing.PolyPolygonShape">
       <g id="id18">
        <rect class="BoundingBox" stroke="none" fill="none" x="291" y="1133" width="3832" height="862"/>
       </g>
      </g>
      <g class="com.sun.star.drawing.PolyPolygonShape">
       <g id="id19">
        <rect class="BoundingBox" stroke="none" fill="none" x="0" y="0" width="4123" height="862"/>
       </g>
      </g>
      <g class="com.sun.star.drawing.PolyPolygonShape">
       <g id="id20">
        <rect class="BoundingBox" stroke="none" fill="none" x="3858" y="151" width="1276" height="443"/>
       </g>
      </g>
      <g class="com.sun.star.drawing.LineShape">
       <g id="id21">
        <rect class="BoundingBox" stroke="none" fill="none" x="3858" y="349" width="664" height="45"/>
        <path fill="none" stroke="rgb(0,0,0)" stroke-width="44" stroke-linejoin="round" d="M 3880,371 L 4499,371"/>
       </g>
      </g>
      <g class="com.sun.star.drawing.PolyPolygonShape">
       <g id="id22">
        <rect class="BoundingBox" stroke="none" fill="none" x="4470" y="151" width="662" height="442"/>
        <path fill="rgb(0,0,0)" stroke="none" d="M 5131,372 L 4470,151 4470,592 5131,372 Z"/>
       </g>
      </g>
      <g class="com.sun.star.drawing.PolyPolygonShape">
       <g id="id23">
        <rect class="BoundingBox" stroke="none" fill="none" x="3880" y="1309" width="1276" height="443"/>
       </g>
      </g>
      <g class="com.sun.star.drawing.LineShape">
       <g id="id24">
        <rect class="BoundingBox" stroke="none" fill="none" x="3881" y="1507" width="664" height="45"/>
        <path fill="none" stroke="rgb(0,0,0)" stroke-width="44" stroke-linejoin="round" d="M 3903,1529 L 4522,1529"/>
       </g>
      </g>
      <g class="com.sun.star.drawing.PolyPolygonShape">
       <g id="id25">
        <rect class="BoundingBox" stroke="none" fill="none" x="4493" y="1309" width="662" height="442"/>
        <path fill="rgb(0,0,0)" stroke="none" d="M 5154,1530 L 4493,1309 4493,1750 5154,1530 Z"/>
       </g>
      </g>
      <g class="com.sun.star.drawing.TextShape">
       <g id="id26">
        <rect class="BoundingBox" stroke="none" fill="none" x="-1250" y="-20611" width="3" height="938"/>
       </g>
      </g>
      <g class="com.sun.star.drawing.TextShape">
       <g id="id27">
        <rect class="BoundingBox" stroke="none" fill="none" x="-1250" y="-20953" width="3" height="938"/>
       </g>
      </g>
      <g class="com.sun.star.drawing.TextShape">
       <g id="id28">
        <rect class="BoundingBox" stroke="none" fill="none" x="5461" y="3430" width="3" height="938"/>
       </g>
      </g>
      <g class="com.sun.star.drawing.TextShape">
       <g id="id29">
        <rect class="BoundingBox" stroke="none" fill="none" x="-1251" y="-20602" width="21" height="36"/>
        <text class="TextShape"><tspan class="TextParagraph" font-family="Liberation Serif, serif" font-size="35px" font-style="italic" font-weight="400"><tspan class="TextPosition" x="-1250" y="-20572"><tspan fill="rgb(0,0,0)" stroke="none">x</tspan></tspan></tspan></text>
       </g>
      </g>
      <g class="com.sun.star.drawing.TextShape">
       <g id="id30">
        <rect class="BoundingBox" stroke="none" fill="none" x="-1250" y="-20611" width="3" height="938"/>
       </g>
      </g>
      <g class="com.sun.star.drawing.TextShape">
       <g id="id31">
        <rect class="BoundingBox" stroke="none" fill="none" x="-1250" y="-20953" width="3" height="938"/>
       </g>
      </g>
      <g class="com.sun.star.drawing.TextShape">
       <g id="id32">
        <rect class="BoundingBox" stroke="none" fill="none" x="5700" y="3400" width="60" height="968"/>
       </g>
      </g>
      <g class="com.sun.star.drawing.TextShape">
       <g id="id33">
        <rect class="BoundingBox" stroke="none" fill="none" x="-1250" y="-20609" width="11" height="35"/>
        <text class="TextShape"><tspan class="TextParagraph" font-family="OpenSymbol" font-size="35px" font-weight="400"><tspan class="TextPosition" x="-1250" y="-20581"><tspan fill="rgb(0,0,0)" stroke="none">[</tspan></tspan></tspan></text>
       </g>
      </g>
      <g class="com.sun.star.drawing.TextShape">
       <g id="id34">
        <rect class="BoundingBox" stroke="none" fill="none" x="-1250" y="-20611" width="3" height="938"/>
       </g>
      </g>
      <g class="com.sun.star.drawing.TextShape">
       <g id="id35">
        <rect class="BoundingBox" stroke="none" fill="none" x="-1250" y="-20953" width="3" height="938"/>
       </g>
      </g>
      <g class="com.sun.star.drawing.TextShape">
       <g id="id36">
        <rect class="BoundingBox" stroke="none" fill="none" x="5958" y="3430" width="3" height="938"/>
       </g>
      </g>
      <g class="com.sun.star.drawing.TextShape">
       <g id="id37">
        <rect class="BoundingBox" stroke="none" fill="none" x="-1250" y="-20602" width="20" height="36"/>
        <text class="TextShape"><tspan class="TextParagraph" font-family="Liberation Serif, serif" font-size="35px" font-style="italic" font-weight="400"><tspan class="TextPosition" x="-1250" y="-20572"><tspan fill="rgb(0,0,0)" stroke="none">n</tspan></tspan></tspan></text>
       </g>
      </g>
      <g class="com.sun.star.drawing.TextShape">
       <g id="id38">
        <rect class="BoundingBox" stroke="none" fill="none" x="-1250" y="-20611" width="3" height="938"/>
       </g>
      </g>
      <g class="com.sun.star.drawing.TextShape">
       <g id="id39">
        <rect class="BoundingBox" stroke="none" fill="none" x="-1250" y="-20953" width="3" height="938"/>
       </g>
      </g>
      <g class="com.sun.star.drawing.TextShape">
       <g id="id40">
        <rect class="BoundingBox" stroke="none" fill="none" x="6255" y="3430" width="3" height="938"/>
       </g>
      </g>
      <g class="com.sun.star.drawing.TextShape">
       <g id="id41">
        <rect class="BoundingBox" stroke="none" fill="none" x="-1250" y="-20609" width="11" height="35"/>
        <text class="TextShape"><tspan class="TextParagraph" font-family="OpenSymbol" font-size="35px" font-weight="400"><tspan class="TextPosition" x="-1250" y="-20581"><tspan fill="rgb(0,0,0)" stroke="none">]</tspan></tspan></tspan></text>
       </g>
      </g>
      <g class="com.sun.star.drawing.TextShape">
       <g id="id42">
        <rect class="BoundingBox" stroke="none" fill="none" x="-1250" y="-20611" width="3" height="938"/>
       </g>
      </g>
      <g class="com.sun.star.drawing.TextShape">
       <g id="id43">
        <rect class="BoundingBox" stroke="none" fill="none" x="-1250" y="-20953" width="3" height="938"/>
       </g>
      </g>
      <g class="com.sun.star.drawing.TextShape">
       <g id="id44">
        <rect class="BoundingBox" stroke="none" fill="none" x="10211" y="1138" width="3" height="938"/>
       </g>
      </g>
      <g class="com.sun.star.drawing.TextShape">
       <g id="id45">
        <rect class="BoundingBox" stroke="none" fill="none" x="-1253" y="-20602" width="23" height="37"/>
        <text class="TextShape"><tspan class="TextParagraph" font-family="Liberation Serif, serif" font-size="35px" font-style="italic" font-weight="400"><tspan class="TextPosition" x="-1250" y="-20572"><tspan fill="rgb(0,0,0)" stroke="none">y</tspan></tspan></tspan></text>
       </g>
      </g>
      <g class="com.sun.star.drawing.TextShape">
       <g id="id46">
        <rect class="BoundingBox" stroke="none" fill="none" x="-1250" y="-20611" width="3" height="938"/>
       </g>
      </g>
      <g class="com.sun.star.drawing.TextShape">
       <g id="id47">
        <rect class="BoundingBox" stroke="none" fill="none" x="-1250" y="-20953" width="3" height="938"/>
       </g>
      </g>
      <g class="com.sun.star.drawing.TextShape">
       <g id="id48">
        <rect class="BoundingBox" stroke="none" fill="none" x="10509" y="1138" width="3" height="938"/>
       </g>
      </g>
      <g class="com.sun.star.drawing.TextShape">
       <g id="id49">
        <rect class="BoundingBox" stroke="none" fill="none" x="-1250" y="-20609" width="11" height="35"/>
        <text class="TextShape"><tspan class="TextParagraph" font-family="OpenSymbol" font-size="35px" font-weight="400"><tspan class="TextPosition" x="-1250" y="-20581"><tspan fill="rgb(0,0,0)" stroke="none">[</tspan></tspan></tspan></text>
       </g>
      </g>
      <g class="com.sun.star.drawing.TextShape">
       <g id="id50">
        <rect class="BoundingBox" stroke="none" fill="none" x="-1250" y="-20611" width="3" height="938"/>
       </g>
      </g>
      <g class="com.sun.star.drawing.TextShape">
       <g id="id51">
        <rect class="BoundingBox" stroke="none" fill="none" x="-1250" y="-20953" width="3" height="938"/>
       </g>
      </g>
      <g class="com.sun.star.drawing.TextShape">
       <g id="id52">
        <rect class="BoundingBox" stroke="none" fill="none" x="10707" y="1138" width="3" height="938"/>
       </g>
      </g>
      <g class="com.sun.star.drawing.TextShape">
       <g id="id53">
        <rect class="BoundingBox" stroke="none" fill="none" x="-1250" y="-20602" width="20" height="36"/>
        <text class="TextShape"><tspan class="TextParagraph" font-family="Liberation Serif, serif" font-size="35px" font-style="italic" font-weight="400"><tspan class="TextPosition" x="-1250" y="-20572"><tspan fill="rgb(0,0,0)" stroke="none">n</tspan></tspan></tspan></text>
       </g>
      </g>
      <g class="com.sun.star.drawing.TextShape">
       <g id="id54">
        <rect class="BoundingBox" stroke="none" fill="none" x="-1250" y="-20611" width="3" height="938"/>
       </g>
      </g>
      <g class="com.sun.star.drawing.TextShape">
       <g id="id55">
        <rect class="BoundingBox" stroke="none" fill="none" x="-1250" y="-20953" width="3" height="938"/>
       </g>
      </g>
      <g class="com.sun.star.drawing.TextShape">
       <g id="id56">
        <rect class="BoundingBox" stroke="none" fill="none" x="11037" y="1138" width="3" height="938"/>
       </g>
      </g>
      <g class="com.sun.star.drawing.TextShape">
       <g id="id57">
        <rect class="BoundingBox" stroke="none" fill="none" x="-1250" y="-20609" width="11" height="35"/>
        <text class="TextShape"><tspan class="TextParagraph" font-family="OpenSymbol" font-size="35px" font-weight="400"><tspan class="TextPosition" x="-1250" y="-20581"><tspan fill="rgb(0,0,0)" stroke="none">]</tspan></tspan></tspan></text>
       </g>
      </g>
      <g class="com.sun.star.drawing.TextShape">
       <g id="id58">
        <rect class="BoundingBox" stroke="none" fill="none" x="-1250" y="-20611" width="3" height="938"/>
       </g>
      </g>
      <g class="com.sun.star.drawing.TextShape">
       <g id="id59">
        <rect class="BoundingBox" stroke="none" fill="none" x="-1250" y="-20953" width="3" height="938"/>
       </g>
      </g>
      <g class="com.sun.star.drawing.TextShape">
       <g id="id60">
        <rect class="BoundingBox" stroke="none" fill="none" x="5328" y="1654" width="3" height="938"/>
       </g>
      </g>
      <g class="com.sun.star.drawing.TextShape">
       <g id="id61">
        <rect class="BoundingBox" stroke="none" fill="none" x="-1250" y="-20602" width="20" height="36"/>
        <text class="TextShape"><tspan class="TextParagraph" font-family="Liberation Serif, serif" font-size="35px" font-weight="400"><tspan class="TextPosition" x="-1250" y="-20572"><tspan fill="rgb(0,0,0)" stroke="none">1</tspan></tspan></tspan></text>
       </g>
      </g>
      <g class="com.sun.star.drawing.TextShape">
       <g id="id62">
        <rect class="BoundingBox" stroke="none" fill="none" x="-1250" y="-20611" width="3" height="938"/>
       </g>
      </g>
      <g class="com.sun.star.drawing.TextShape">
       <g id="id63">
        <rect class="BoundingBox" stroke="none" fill="none" x="-1250" y="-20953" width="3" height="938"/>
       </g>
      </g>
      <g class="com.sun.star.drawing.TextShape">
       <g id="id64">
        <rect class="BoundingBox" stroke="none" fill="none" x="5328" y="590" width="3" height="938"/>
       </g>
      </g>
      <g class="com.sun.star.drawing.TextShape">
       <g id="id65">
        <rect class="BoundingBox" stroke="none" fill="none" x="-1250" y="-20602" width="20" height="36"/>
        <text class="TextShape"><tspan class="TextParagraph" font-family="Liberation Serif, serif" font-size="35px" font-weight="400"><tspan class="TextPosition" x="-1250" y="-20572"><tspan fill="rgb(0,0,0)" stroke="none">0</tspan></tspan></tspan></text>
       </g>
      </g>
      <g class="com.sun.star.drawing.TextShape">
       <g id="id66">
        <rect class="BoundingBox" stroke="none" fill="none" x="-1250" y="-20611" width="3" height="938"/>
       </g>
      </g>
      <g class="com.sun.star.drawing.TextShape">
       <g id="id67">
        <rect class="BoundingBox" stroke="none" fill="none" x="-1250" y="-20925" width="3" height="938"/>
       </g>
      </g>
      <g class="com.sun.star.drawing.TextShape">
       <g id="id68">
        <rect class="BoundingBox" stroke="none" fill="none" x="604" y="1680" width="3" height="938"/>
       </g>
      </g>
      <g class="com.sun.star.drawing.TextShape">
       <g id="id69">
        <rect class="BoundingBox" stroke="none" fill="none" x="-1250" y="-20602" width="236" height="36"/>
        <text class="TextShape"><tspan class="TextParagraph" font-family="Liberation Mono" font-size="35px" font-weight="400"><tspan class="TextPosition" x="-1250" y="-20577"><tspan fill="rgb(0,0,0)" stroke="none">mark_symbol</tspan></tspan></tspan></text>
       </g>
      </g>
      <g class="com.sun.star.drawing.TextShape">
       <g id="id70">
        <rect class="BoundingBox" stroke="none" fill="none" x="-1250" y="-20611" width="3" height="938"/>
       </g>
      </g>
      <g class="com.sun.star.drawing.TextShape">
       <g id="id71">
        <rect class="BoundingBox" stroke="none" fill="none" x="-1250" y="-20925" width="3" height="938"/>
       </g>
      </g>
      <g class="com.sun.star.drawing.TextShape">
       <g id="id72">
        <rect class="BoundingBox" stroke="none" fill="none" x="313" y="547" width="3" height="938"/>
       </g>
      </g>
      <g class="com.sun.star.drawing.TextShape">
       <g id="id73">
        <rect class="BoundingBox" stroke="none" fill="none" x="-1250" y="-20602" width="257" height="36"/>
        <text class="TextShape"><tspan class="TextParagraph" font-family="Liberation Mono" font-size="35px" font-weight="400"><tspan class="TextPosition" x="-1250" y="-20577"><tspan fill="rgb(0,0,0)" stroke="none">space_symbol</tspan></tspan></tspan></text>
       </g>
      </g>
      <g class="com.sun.star.drawing.TextShape">
       <g id="id74">
        <rect class="BoundingBox" stroke="none" fill="none" x="1424" y="-154" width="2577" height="955"/>
        <text class="TextShape"><tspan class="TextParagraph" font-family="Liberation Sans, sans-serif" font-size="635px" font-weight="400"><tspan class="TextPosition" x="1674" y="543"><tspan fill="rgb(0,0,0)" stroke="none">input_1</tspan></tspan></tspan></text>
       </g>
      </g>
      <g class="com.sun.star.drawing.TextShape">
       <g id="id75">
        <rect class="BoundingBox" stroke="none" fill="none" x="1424" y="1000" width="2577" height="955"/>
        <text class="TextShape"><tspan class="TextParagraph" font-family="Liberation Sans, sans-serif" font-size="635px" font-weight="400"><tspan class="TextPosition" x="1674" y="1697"><tspan fill="rgb(0,0,0)" stroke="none">input_2</tspan></tspan></tspan></text>
       </g>
      </g>
      <g class="com.sun.star.drawing.TextShape">
       <g id="id76">
        <rect class="BoundingBox" stroke="none" fill="none" x="7500" y="400" width="2264" height="955"/>
        <text class="TextShape"><tspan class="TextParagraph" font-family="Liberation Sans, sans-serif" font-size="635px" font-weight="400"><tspan class="TextPosition" x="7750" y="1097"><tspan fill="rgb(0,0,0)" stroke="none">output</tspan></tspan></tspan></text>
       </g>
      </g>
      <g class="com.sun.star.drawing.TextShape">
       <g id="id77">
        <rect class="BoundingBox" stroke="none" fill="none" x="4637" y="2600" width="2649" height="955"/>
        <text class="TextShape"><tspan class="TextParagraph" font-family="Liberation Sans, sans-serif" font-size="635px" font-weight="400"><tspan class="TextPosition" x="4887" y="3297"><tspan fill="rgb(0,0,0)" stroke="none">inselect</tspan></tspan></tspan></text>
       </g>
      </g>
      <g class="com.sun.star.drawing.TextShape">
       <g id="id78">
        <rect class="BoundingBox" stroke="none" fill="none" x="5123" y="1000" width="778" height="799"/>
        <text class="TextShape"><tspan class="TextParagraph" font-family="Liberation Sans, sans-serif" font-size="494px" font-weight="400"><tspan class="TextPosition" x="5373" y="1570"><tspan fill="rgb(0,0,0)" stroke="none">1</tspan></tspan></tspan></text>
       </g>
      </g>
      <g class="com.sun.star.drawing.TextShape">
       <g id="id79">
        <rect class="BoundingBox" stroke="none" fill="none" x="5100" y="200" width="778" height="799"/>
        <text class="TextShape"><tspan class="TextParagraph" font-family="Liberation Sans, sans-serif" font-size="494px" font-weight="400"><tspan class="TextPosition" x="5350" y="770"><tspan fill="rgb(0,0,0)" stroke="none">0</tspan></tspan></tspan></text>
       </g>
      </g>
     </g>
    </g>
   </g>
  </g>
 </g>
</svg>