{
  "apiToken": "",
  "projectId": "",
  "fileType": "key_value_json",
  "targetDir": "./src/i18n",
  "syncTerms": true,
  "sourceLang": "it-IT",
  "pullParams": {
    "tags": "appuntamenti"
  },
  "pushParams": {
    "tags": "{\"all\":\"appuntamenti\"}"
  }
}
