{
    "summary": "Deploy Services",
    "description": "",
    "value": {
        "modules": [
            {
                "id": "e",
                "retry": {
                    "constant": {
                        "seconds": 1,
                        "attempts": 1
                    },
                    "exponential": {
                        "seconds": 2,
                        "attempts": 2,
                        "multiplier": 1
                    }
                },
                "value": {
                    "path": "f/sdc/ensure_auth_token",
                    "type": "flow",
                    "input_transforms": {
                        "base_url": {
                            "expr": "flow_input.destination_base_url",
                            "type": "javascript"
                        },
                        "auth_credential": {
                            "expr": "flow_input.API_ADMIN",
                            "type": "javascript"
                        }
                    }
                },
                "summary": "Ensure auth token"
            },
            {
                "id": "i",
                "retry": {
                    "constant": {
                        "seconds": 1,
                        "attempts": 1
                    },
                    "exponential": {
                        "seconds": 2,
                        "attempts": 2,
                        "multiplier": 1
                    }
                },
                "value": {
                    "lock": "certifi==2024.2.2\ncharset-normalizer==3.3.2\nidna==3.6\nrequests==2.31.0\nurllib3==2.2.1",
                    "type": "rawscript",
                    "content": "import requests, json\n\n\ndef check_error(response, link):\n    if not 200 <= response.status_code <= 299:\n        try:\n            print(\"ERROR - with response json: \", response.json(), link)\n        except json.JSONDecodeError:\n            print(\"ERROR - with response: \", response, link)\n        raise requests.HTTPError(\"Raise for status > 299\")\n\n\ndef main(tenant_base_url):\n    tenant_base_url = tenant_base_url.rstrip().rstrip('/')\n    url = tenant_base_url+\"/api/tenants/info\"\n    response = requests.get(url)\n    check_error(response, url)\n    info = response.json()\n    info['base_url'] = tenant_base_url\n    return info\n",
                    "language": "python3",
                    "input_transforms": {
                        "tenant_base_url": {
                            "expr": "flow_input.destination_base_url",
                            "type": "javascript"
                        }
                    }
                },
                "summary": "Get destination tenant info"
            },
            {
                "id": "a",
                "retry": {
                    "constant": {
                        "seconds": 1,
                        "attempts": 1
                    },
                    "exponential": {
                        "seconds": 2,
                        "attempts": 2,
                        "multiplier": 1
                    }
                },
                "value": {
                    "lock": "anyio==4.3.0\ncertifi==2024.2.2\ncharset-normalizer==3.3.2\nh11==0.14.0\nhttpcore==0.17.3\nhttpx==0.24.1\nidna==3.6\nrequests==2.31.0\nsniffio==1.3.1\nurllib3==2.2.1\nwmill==1.303.0",
                    "type": "rawscript",
                    "content": "import wmill\nimport requests\nimport json\n\n\nnew_default_operator = {\n  \"role\": \"operator\",\n  \"nome\": \"Ufficio\",\n  \"username\": \"urp\",\n  \"password\": \"#Fnr*Vh!G@v6vCUV\",\n  \"cognome\": \"URP\",\n  \"email\": \"urp.blackhole@opencontent.it\",\n  \"codice_fiscale\": \"\",\n  \"data_nascita\": \"\",\n  \"luogo_nascita\": \"\",\n  \"codice_nascita\": \"\",\n  \"provincia_nascita\": \"\",\n  \"stato_nascita\": \"\",\n  \"sesso\": \"\",\n  \"telefono\": \"\",\n  \"cellulare\": \"\",\n  \"indirizzo_domicilio\": \"\",\n  \"cap_domicilio\": \"\",\n  \"citta_domicilio\": \"\",\n  \"provincia_domicilio\": \"\",\n  \"stato_domicilio\": \"\",\n  \"indirizzo_residenza\": \"\",\n  \"cap_residenza\": \"\",\n  \"citta_residenza\": \"\",\n  \"provincia_residenza\": \"\",\n  \"stato_residenza\": \"\"\n}\n\ndef check_error(response, link):\n    if not 200 <= response.status_code <= 299:\n        try:\n            print(\"ERROR - with response json: \", response.json(), link)\n        except json.JSONDecodeError:\n            print(\"ERROR - with response: \", response, link)\n        raise requests.HTTPError(\"Raise for status > 299\")\n\n\ndef get_default_operator(destination_base_url, default_operator, headers):\n  url = f\"{destination_base_url}/api/users?roles=operator&username={default_operator}\"\n  print(f\"Searching for the default operator at url {url}\")\n  users = requests.get(url=url, headers=headers)\n  print(\"Users: \",users.json())\n  if users.status_code == 200 and users.json():\n    return users.json()[0]\n\n\ndef create_default_operator(destination_base_url, default_operator, headers): \n  url = f\"{destination_base_url}/api/users\"\n  print(\"Creating operator at \", url)\n  new_default_operator['username'] = default_operator\n  response = requests.post(url=url, data=json.dumps(new_default_operator), headers=headers)\n  print(\"Default operator created \",response)\n  check_error(response, url)\n  print(\"Default operator created \",response.json())\n  return response.json()\n\ndef get_operator_token(base_url, default_operator):\n    auth_credential = {\n        \"username\": default_operator,\n        \"password\": new_default_operator['password']\n    }\n    print(auth_credential)\n    response = requests.post(\n        f\"{base_url}/api/auth\",\n        data=json.dumps(auth_credential),\n        headers={\"Content-Type\": \"application/json\"},\n    )\n    print(response)\n    check_error(response, f\"{base_url}/api/auth\")\n    return response.json()[\"token\"]\n\n\ndef main(destination_base_url, default_operator, service, token):\n  headers = {\"Content-Type\": \"application/json\", \"Authorization\": f\"Bearer {token}\"}\n  destination_base_url = destination_base_url.rstrip('/')\n  print(service)\n  default_operator_user = (\n    get_default_operator(destination_base_url, default_operator, headers) \n    or create_default_operator(destination_base_url, default_operator, headers) \n  )\n  default_operator_user[\"token\"] = get_operator_token(destination_base_url, default_operator)\n  return default_operator_user\n",
                    "language": "python3",
                    "input_transforms": {
                        "token": {
                            "expr": "results.e",
                            "type": "javascript"
                        },
                        "service": {
                            "expr": "flow_input.services_to_deploy",
                            "type": "javascript"
                        },
                        "default_operator": {
                            "expr": "flow_input.USERNAME_DEFAULT_OPERATOR",
                            "type": "javascript"
                        },
                        "destination_base_url": {
                            "expr": "flow_input.destination_base_url",
                            "type": "javascript"
                        }
                    }
                },
                "summary": "Ensure default operator"
            },
            {
                "id": "f",
                "value": {
                    "type": "forloopflow",
                    "modules": [
                        {
                            "id": "g",
                            "retry": {
                                "constant": {
                                    "seconds": 1,
                                    "attempts": 1
                                },
                                "exponential": {
                                    "seconds": 2,
                                    "attempts": 2,
                                    "multiplier": 1
                                }
                            },
                            "value": {
                                "type": "rawscript",
                                "content": "import requests, json\n\ndef check_error(response, link):\n    if not 200 <= response.status_code <= 299:\n        try:\n            print(\"ERROR - with response json: \", response.json(), link)\n        except json.JSONDecodeError:\n            print(\"ERROR - with response: \", response, link)\n        raise requests.HTTPError(\"Raise for status > 299\")\n\n\ndef main(source_base_url, identifier):\n    url = f\"{source_base_url.rstrip('/')}/api/services/{identifier}\"\n    result = requests.get(url)\n    check_error(result, url)\n    return result.json()",
                                "language": "python3",
                                "input_transforms": {
                                    "identifier": {
                                        "expr": "flow_input.iter.value",
                                        "type": "javascript"
                                    },
                                    "source_base_url": {
                                        "expr": "flow_input.source_base_url",
                                        "type": "javascript"
                                    }
                                }
                            },
                            "summary": "Get service from identifier"
                        },
                        {
                            "id": "b",
                            "retry": {
                                "constant": {
                                    "seconds": 2,
                                    "attempts": 1
                                },
                                "exponential": {
                                    "seconds": 2,
                                    "attempts": 2,
                                    "multiplier": 1
                                }
                            },
                            "value": {
                                "lock": "certifi==2023.5.7\ncharset-normalizer==3.1.0\nidna==3.4\nrequests==2.31.0\nurllib3==2.0.3",
                                "type": "rawscript",
                                "content": "import requests\nimport json\nfrom datetime import datetime\n\nbasic_auth_form_builder = requests.auth.HTTPBasicAuth('oc', 'gabricecek')\n\ndef check_error(response, link):\n    if not 200 <= response.status_code <= 299:\n        try:\n            print(\"ERROR - with response json: \", response.json(), link)\n        except json.JSONDecodeError:\n            print(\"ERROR - with response: \", response, link)\n        raise requests.HTTPError(\"Raise for status > 299\")\n\ndef clone_form(source_service, form_path):\n  print(\"Cleaning and cloning form...\")\n  form_parameters = source_service['flow_steps'][0]['parameters']\n  source_form_url = f\"{form_parameters['url']}{form_parameters['formio_id']}\"\n  form = requests.get(source_form_url).json()\n  key_to_remove = ('_id','modified','created','__v')\n  for key in key_to_remove:\n    form.pop(key)\n  form['path'] = form_path\n  form['name'] = form_path\n  return form\n\n\ndef create_form(source_service, form_path, destination_from_builder_url):\n  new_form_to_create = clone_form(source_service, form_path)\n  print(\"Creating a new form...\", json.dumps(new_form_to_create))\n  new_form_created = requests.post(\n    url=destination_from_builder_url,\n    data=json.dumps(new_form_to_create),\n    auth=basic_auth_form_builder,\n    headers={'Content-Type': 'application/json'}\n  )\n  check_error(new_form_created, destination_from_builder_url)\n  return new_form_created.json()\n\n\ndef main(source_service, destination_from_url, destination_base_url, destination_from_builder_url, tenant_info, override_form):\n  destination_from_url = destination_from_url.rstrip().rstrip('/')\n  destination_base_url = destination_base_url.rstrip().rstrip('/')\n  destination_from_builder_url = destination_from_builder_url.rstrip().rstrip('/')\n  form_path = f\"{tenant_info.get('slug')}_{source_service.get('identifier')}\"\n  try:\n    url=f\"{destination_from_url}/{form_path}\"\n    print(\"Checking if form exist at url: \", url)\n    response = requests.get(url=f\"{destination_from_url}/{form_path}\")\n    check_error(response, url)\n    print(\"Form exists\")\n    # TODO: aggiorna form. Ipotesi: se updated_at del servizio è maggiore di created_at non tocco nulla, \n    # altrimenti se updated_at del source di destinazione è minore di quello del servizio sorgente fai put di aggiornamento\n    return response.json()\n  except requests.HTTPError:\n    print(\"Form doesn't exists\")\n    return create_form(source_service, form_path, destination_from_builder_url)\n",
                                "language": "python3",
                                "input_transforms": {
                                    "tenant_info": {
                                        "expr": "results.i",
                                        "type": "javascript"
                                    },
                                    "override_form": {
                                        "expr": "flow_input.override_destination_form",
                                        "type": "javascript"
                                    },
                                    "source_service": {
                                        "expr": "results.g",
                                        "type": "javascript"
                                    },
                                    "destination_base_url": {
                                        "expr": "flow_input.destination_base_url",
                                        "type": "javascript"
                                    },
                                    "destination_from_url": {
                                        "expr": "flow_input.destination_from_url",
                                        "type": "javascript"
                                    },
                                    "destination_from_builder_url": {
                                        "expr": "flow_input.destination_from_builder_url",
                                        "type": "javascript"
                                    }
                                }
                            },
                            "summary": "Ensure form"
                        },
                        {
                            "id": "c",
                            "retry": {
                                "constant": {
                                    "seconds": 1,
                                    "attempts": 1
                                },
                                "exponential": {
                                    "seconds": 2,
                                    "attempts": 2,
                                    "multiplier": 1
                                }
                            },
                            "value": {
                                "lock": "anyio==3.7.0\nattrs==23.1.0\ncertifi==2023.5.7\ncharset-normalizer==3.1.0\nh11==0.14.0\nhttpcore==0.16.3\nhttpx==0.23.3\nidna==3.4\npython-dateutil==2.8.2\nrequests==2.31.0\nrfc3986[idna2008]==1.5.0\nsix==1.16.0\nsniffio==1.3.0\nurllib3==2.0.3\nwindmill-api==1.114.2\nwmill==1.114.2",
                                "type": "rawscript",
                                "content": "import wmill\nimport requests\nimport json\n\n\nnew_user_group = {\n  \"topic_id\": None,\n  \"manager_id\": None,\n  \"core_location_id\": None,\n  \"calendar_id\": None,\n  \"name\": \"\",\n  \"short_description\": None,\n  \"main_function\": None,\n  \"more_info\": None,\n  \"core_contact_point\": None,\n  \"calendar_id\": None\n}\n\nnew_calendar = {\n  \"owner\": \"\",\n  \"moderators\": [],\n  \"opening_hours\": [],\n  \"drafts_duration\": 600,\n  \"drafts_duration_increment\": None,\n  \"title\": \"Default\",\n  \"type\": \"time_fixed_slots\",\n  \"contact_email\": \"\",\n  \"rolling_days\": 30,\n  \"minimum_scheduling_notice\": 24,\n  \"allow_cancel_days\": 3,\n  \"allow_overlaps\": False,\n  \"is_moderated\": False,\n  \"location\": \"\",\n  \"external_calendars\": [],\n  \"closing_periods\": []\n}\n\nnew_opening_hour = {\n  \"name\": \"\",\n  \"start_date\": \"2024-01-01T00:00:00+01:00\",\n  \"end_date\": \"2025-12-31T00:00:00+01:00\",\n  \"days_of_week\": [ 1, 2, 3, 4, 5 ],\n  \"begin_hour\": \"09:00\",\n  \"end_hour\": \"13:00\",\n  \"is_moderated\": False,\n  \"meeting_minutes\": 30,\n  \"interval_minutes\": 0,\n  \"meeting_queue\": 1\n}\n\n\nnew_place = {\n  \"name\": \"Palazzo del comune\",\n  \"topic_id\": None,\n  \"geographic_area_ids\": [],\n  \"other_name\": \"\",\n  \"short_description\": \"\",\n  \"description\": \"\",\n  \"address\": None,\n  \"latitude\": None,\n  \"longitude\": None,\n  \"more_info\": \"\",\n  \"identifier\": None,\n  \"core_contact_point\": None\n}\n\ndef check_error(response, link):\n    if not 200 <= response.status_code <= 299:\n        try:\n            print(\"ERROR - with response json: \", response.json(), link)\n        except json.JSONDecodeError:\n            print(\"ERROR - with response: \", response, link)\n        raise requests.HTTPError(\"Raise for status > 299\")\n\n\ndef create_opening_hour(calendar_id, name, base_url, default_operator):\n  url = f\"{base_url}/api/calendars/{calendar_id}/opening-hours\"\n  print(f\"Creating opening hour at {url}\")\n  opening_hour = new_opening_hour.copy()\n  opening_hour['name'] = \"Orario \" + name\n  # L'orario di apertura può essere creato solo da un operatore del calendario\n  headers = {\"Content-Type\": \"application/json\", \"Authorization\": f\"Bearer {default_operator['token']}\"}\n  # TODO: now = datetime.now().replace(microsecond=0).astimezone().isoformat() # FIXME: imposta start a oggi e end a fine anno\n  response = requests.post(url=url, data=json.dumps(opening_hour), headers=headers)\n  print(f\"Opening hour response:\", response)\n  # check_error(response) # me ne frego se non riesco a crearlo\n\n\ndef create_default_place(base_url, headers):\n    print(\"Creating default place\")\n    url = f\"{base_url}/api/places\"\n    response = requests.post(url, json.dumps(new_place),headers=headers)\n    check_error(response, url)\n    return response.json()['id']\n\n\ndef ensure_default_place(base_url, headers):\n    name = new_place['name'].replace(' ', '%20')\n    response = requests.get(url=f\"{base_url}/api/places?name={name}\", headers=headers)\n    if response.status_code == 200 and response.json():\n        print(\"Default place already exists getting first id in retourned list\")\n        return response.json()[0]['id']\n    else:\n        return create_default_place(base_url, headers)\n\n\ndef create_calendar(name, base_url, default_operator, headers):\n  print(\"Creating new calendar...\")\n  calendar = new_calendar.copy()\n  calendar['title'] = name\n  calendar['owner'] = default_operator['id']\n  calendar['location'] = ensure_default_place(base_url, headers)\n  url = f\"{base_url}/api/calendars\"\n  response = requests.post(url=url, data=json.dumps(calendar), headers=headers)\n  check_error(response, url)\n  calendar_id = response.json()['id']\n  create_opening_hour(calendar_id, name, base_url, default_operator)\n  return calendar_id\n\n\ndef ensure_calendar(base_url, name, default_operator, headers):\n    url = f\"{base_url}/api/calendars?title={name}\".replace(' ', '%20')\n    print(\"Verifico che il calendario esista: \", url)\n    response = requests.get(url, allow_redirects=False, headers=headers)\n    if response.status_code == 200 and response.json():\n        calendar = response.json()[0]\n        print(\"Calendar found in destination tenant with id: \", calendar['id'])\n        if not calendar['opening_hours']:\n            create_opening_hour(calendar['id'], name, base_url, default_operator)\n        return calendar['id']\n    else:\n        print(\"Il calendario non è sul tenant, lo creo\")\n        return create_calendar(name, base_url, default_operator, headers)\n\n\ndef create_destination_user_group(name, destination_base_url, default_operator, headers):\n  url = f\"{destination_base_url}/api/user-groups\"\n  print(\"Office not found, creating it at \", url)\n  user_group = new_user_group.copy()\n  user_group['name'] = name\n  user_group['manager_id'] = default_operator['id']\n  user_group['calendar_id'] = ensure_calendar(destination_base_url, name, default_operator, headers)\n  response = requests.post(url=url, data=json.dumps(user_group), headers=headers)\n  check_error(response, url)\n  return response.json()['id']\n\n\ndef get_destination_user_group_id(name, base_url, default_operator, headers):\n  user_group_url = f\"{base_url}/api/user-groups?name={name}\".replace(' ', '%20')\n  print(f\"Calling {user_group_url}\")\n  response = requests.get(user_group_url)\n  if response.status_code == 200 and response.json():\n    user_group = response.json()[0]\n    if user_group:\n      if not user_group['calendar_id']:\n        calendar_id = ensure_calendar(base_url, user_group.get('name'), default_operator, headers)\n        data = json.dumps({'calendar_id': calendar_id})\n        url = f\"{base_url}/api/user-groups/{user_group['id']}\"\n        response = requests.patch(url=url, data=data, headers=headers)\n        check_error(response, url)\n      else:\n        # Se c'è l'ID la primary key mi garantisce la corrispondenza con tabella calendario\n        # e semplicemente verifico che abbia place e opening_hour collegati\n        response = requests.get(f\"{base_url}/api/calendars/{user_group['calendar_id']}\")\n        title = response.json()['title']\n        ensure_calendar(base_url, title, default_operator, headers)\n\n      return user_group['id']\n\n\ndef get_user_group(id, base_url):\n  print(\"Getting source user group name...\")\n  user_group = requests.get(f\"{base_url}/api/user-groups/{id}\")\n  user_group.raise_for_status()\n  return user_group.json()\n\n\ndef add_default_operator_to_office(destination_base_url, destination_user_group_id, default_operator, headers):\n    url = f\"{destination_base_url}/api/user-groups/{destination_user_group_id}/members\"\n    data = json.dumps([default_operator['id']])\n    response = requests.post(url=url, data=data, headers=headers)\n    print(f\"added default operator in office at url {url} with response {response}\")\n\n\ndef ensure_office(user_group_source_name, destination_base_url, default_operator, headers):\n    print(\"Ensuring user group in destination tenant: \", user_group_source_name)\n    return (\n        get_destination_user_group_id(user_group_source_name, destination_base_url, default_operator, headers)\n        or create_destination_user_group(user_group_source_name, destination_base_url, default_operator, headers)\n    )\n\n\ndef main(source_service, source_base_url, destination_base_url, default_operator, token):\n  headers = {\"Content-Type\": \"application/json\", \"Authorization\": f\"Bearer {token}\"}\n  source_base_url = source_base_url.strip().rstrip('/')\n  destination_base_url = destination_base_url.strip().rstrip('/')\n  ensure_office(\"Ufficio del Sindaco\", destination_base_url, default_operator, headers)\n  destination_user_group_ids = []\n  for source_user_group_id in source_service['user_group_ids']:\n    user_group_source_name = get_user_group(source_user_group_id, source_base_url)['name']\n    destination_user_group_id = ensure_office(user_group_source_name, destination_base_url, default_operator, headers)\n    destination_user_group_ids.append(destination_user_group_id)\n    add_default_operator_to_office(destination_base_url, destination_user_group_id, default_operator, headers)\n  print(\"Adding following offices: \", destination_user_group_ids)\n  return destination_user_group_ids\n",
                                "language": "python3",
                                "input_transforms": {
                                    "token": {
                                        "expr": "results.e",
                                        "type": "javascript"
                                    },
                                    "source_service": {
                                        "expr": "results.g",
                                        "type": "javascript"
                                    },
                                    "source_base_url": {
                                        "expr": "flow_input.source_base_url",
                                        "type": "javascript"
                                    },
                                    "default_operator": {
                                        "expr": "results.a",
                                        "type": "javascript"
                                    },
                                    "destination_base_url": {
                                        "expr": "flow_input.destination_base_url",
                                        "type": "javascript"
                                    }
                                }
                            },
                            "summary": "Ensure offices"
                        },
                        {
                            "id": "d",
                            "retry": {
                                "constant": {
                                    "seconds": 1,
                                    "attempts": 1
                                },
                                "exponential": {
                                    "seconds": 2,
                                    "attempts": 2,
                                    "multiplier": 1
                                }
                            },
                            "value": {
                                "lock": "anyio==3.7.0\nattrs==23.1.0\ncertifi==2023.5.7\ncharset-normalizer==3.1.0\nh11==0.14.0\nhttpcore==0.16.3\nhttpx==0.23.3\nidna==3.4\npython-dateutil==2.8.2\nrequests==2.31.0\nrfc3986[idna2008]==1.5.0\nsix==1.16.0\nsniffio==1.3.0\nurllib3==2.0.3\nwindmill-api==1.114.2\nwmill==1.114.2",
                                "type": "rawscript",
                                "content": "import requests\nimport hashlib\nimport json\nimport wmill\nfrom datetime import datetime\n\nPHASE = { 0 : \"request\", 1 : \"release\"}\n\ndef check_error(response, link):\n    if not 200 <= response.status_code <= 299:\n        try:\n            print(\"ERROR - with response json: \", response.json(), link)\n        except json.JSONDecodeError:\n            print(\"ERROR - with response: \", response, link)\n        raise requests.HTTPError(\"Raise for status > 299\")\n\n\ndef clone_service(source_service, new_form, destination_user_group_ids, site_url, destination_from_url, source_base_url, protocol_default):\n  print(\"Cloning service...\")\n  destination_service = source_service.copy()\n  new_form_id = new_form['_id']\n  source_service_id = source_service['id']\n\n  destination_service['booking_call_to_action'] = f\"{site_url}/prenota_appuntamento\"\n  destination_service['external_card_url'] = f\"{site_url}/openpa/object/{source_service['identifier']}\"\n  destination_service['flow_steps'][0]['identifier'] = new_form_id\n  destination_service['flow_steps'][0]['parameters']['formio_id'] = new_form_id\n  destination_service['user_group_ids'] = destination_user_group_ids\n  destination_service['status'] = 3 # Importa come servizio privato\n  destination_service['source'] = {}\n  destination_service['source']['id'] = source_service_id\n  destination_service['source']['url'] = f\"{source_base_url}/api/services/{source_service_id}\"\n  destination_service['source']['updated_at'] = source_service['updated_at']\n  destination_service['source']['md5'] = hashlib.md5(json.dumps(source_service).encode('utf-8')).hexdigest()\n  destination_service['source']['identifier'] = source_service['identifier']\n  destination_service[\"protocol_handler\"] = \"pec\"\n  destination_service[\"protocollo_parameters\"] = protocol_default\n  destination_service[\"satisfy_entrypoint_id\"] = \"\"\n  destination_service[\"allow_reopening\"] = False\n  destination_service[\"allow_withdraw\"] = False\n  if 'stamps' in destination_service and destination_service['stamps']:\n    for item in destination_service['stamps']:\n        item[\"phase\"] = PHASE[item[\"phase\"]]\n\n  if \"payment_parameters\" in destination_service and type(destination_service[\"payment_parameters\"]) is dict:\n    destination_service[\"payment_parameters\"][\"gateways\"] = []\n\n  key_to_delete = ['id', 'tenant', 'slug', 'topics_id', 'updated_at', 'created_at', 'app_version']\n  print(f\"Deleting following keys in service {key_to_delete}\")\n  for key in key_to_delete:\n    destination_service.pop(key)\n  return destination_service\n\ndef update_booking_call_to_action(destination_base_url, destination_service_id, site_url, headers):\n    data = json.dumps({\"booking_call_to_action\": f\"{site_url}/prenota_appuntamento?service_id={destination_service_id}\"})\n    url = f\"{destination_base_url}/api/services/{destination_service_id}\"\n    print(f\"Updating booking_call_to_action at {url}\")\n    response = requests.patch(url=url, data=data, headers=headers)\n    check_error(response, url)\n\n\ndef create_or_update_service(destination_base_url, new_service, headers):\n  url=f\"{destination_base_url}/api/services\"\n  now = datetime.now()\n  response = requests.get(f\"{url}/{new_service['identifier']}?_={now}\")\n  print(f\"Searching service at {url}/{new_service['identifier']}, with response {response}\")\n  if 200 <= response.status_code <= 299 and type(response.json()) is dict and 'id' in response.json():\n    url = f\"{url}/{response.json()['id']}\"\n    keys_not_to_be_updated = [\"protocol_handler\", \"protocollo_parameters\", \"protocol_required\", \"payment_required\", \"payment_parameters\"]\n    for key in keys_not_to_be_updated:\n        new_service.pop(key)\n    response_put = requests.patch(url=url, data=json.dumps(new_service), headers=headers)\n    print(f\"Updating the service {new_service['identifier']} with response {response}\")\n    check_error(response_put, url)\n  else:\n    response = requests.post(url=url, data=json.dumps(new_service), headers=headers)\n    print(f\"Creating the service {new_service['identifier']} with response {response}\")\n    check_error(response, url)\n  return response.json()\n\n\ndef main(source_service, new_form, destination_user_group_ids, destination_base_url, destination_from_url, source_base_url, protocol_default, site_url, token): \n  headers = {\"Content-Type\": \"application/json\", \"Authorization\": f\"Bearer {token}\"}\n  destination_base_url = destination_base_url.rstrip('/')\n  destination_from_url = destination_from_url.rstrip('/')\n  source_base_url = source_base_url.rstrip('/')\n  site_url = site_url.rstrip('/')\n  new_service = clone_service(source_service, new_form, destination_user_group_ids, site_url, destination_from_url, source_base_url, protocol_default)\n  saved_service = create_or_update_service(destination_base_url, new_service, headers)\n  if saved_service:\n    update_booking_call_to_action(destination_base_url, saved_service['id'], site_url, headers)\n",
                                "language": "python3",
                                "input_transforms": {
                                    "token": {
                                        "expr": "results.e",
                                        "type": "javascript"
                                    },
                                    "new_form": {
                                        "expr": "results.b",
                                        "type": "javascript"
                                    },
                                    "site_url": {
                                        "expr": "flow_input.input_site_url",
                                        "type": "javascript"
                                    },
                                    "source_service": {
                                        "expr": "results.g",
                                        "type": "javascript"
                                    },
                                    "source_base_url": {
                                        "expr": "flow_input.source_base_url",
                                        "type": "javascript"
                                    },
                                    "protocol_default": {
                                        "expr": "flow_input.PROTOCOL_DEFAULT",
                                        "type": "javascript"
                                    },
                                    "destination_base_url": {
                                        "expr": "flow_input.destination_base_url",
                                        "type": "javascript"
                                    },
                                    "destination_from_url": {
                                        "expr": "flow_input.destination_from_url",
                                        "type": "javascript"
                                    },
                                    "destination_user_group_ids": {
                                        "expr": "results.c",
                                        "type": "javascript"
                                    }
                                }
                            },
                            "summary": "Create service"
                        },
                        {
                            "id": "j",
                            "retry": {
                                "constant": {
                                    "seconds": 2,
                                    "attempts": 1
                                },
                                "exponential": {
                                    "seconds": 2,
                                    "attempts": 2,
                                    "multiplier": 1
                                }
                            },
                            "value": {
                                "type": "rawscript",
                                "content": "import requests\nimport wmill\nimport json\n\nSTATUS_DRAFT = json.dumps({\"status\":0})\n\ndef check_error(response, link):\n    if not 200 <= response.status_code <= 299:\n        try:\n            print(\"ERROR - with response json: \", response.json(), link)\n        except json.JSONDecodeError:\n            print(\"ERROR - with response: \", response, link)\n        raise requests.HTTPError(\"Raise for status > 299\")\n\n\ndef set_service_to_draft(destination_base_url, service, headers):\n    url = f\"{destination_base_url}/api/services/{service['id']}\"\n    response = requests.patch(url=url,data=STATUS_DRAFT,headers=headers)\n    check_error(response, url)\n    print(response.json())\n\n\ndef main(destination_base_url, identifier, token):\n    headers = {\"Content-Type\": \"application/json\", \"Authorization\": f\"Bearer {token}\"}\n    url = f\"{destination_base_url.rstrip('/')}/api/services/{identifier}\"\n    result = requests.get(url)\n    check_error(result, url)\n    service = result.json()\n    # set_service_to_draft(destination_base_url, service, headers)\n    return service",
                                "language": "python3",
                                "input_transforms": {
                                    "token": {
                                        "type": "static",
                                        "value": null
                                    },
                                    "identifier": {
                                        "expr": "flow_input.iter.value",
                                        "type": "javascript"
                                    },
                                    "destination_base_url": {
                                        "expr": "flow_input.destination_base_url",
                                        "type": "javascript"
                                    }
                                }
                            },
                            "summary": "Get service updated"
                        },
                        {
                            "id": "h",
                            "retry": {
                                "constant": {
                                    "seconds": 1,
                                    "attempts": 1
                                },
                                "exponential": {
                                    "seconds": 2,
                                    "attempts": 2,
                                    "multiplier": 1
                                }
                            },
                            "value": {
                                "type": "rawscript",
                                "content": "import requests\nimport json\n\nbasic_auth_site = requests.auth.HTTPBasicAuth('admin', 'Krop0t!boO44')\n\nSTATUS_NON_ATTIVO = {\n  \"status\": \"Servizio non attivo\",\n  \"message\": \"Il servizio non è attivo\"\n}\n\nSTATUS_ATTIVO = {\n  \"status\": \"Servizio attivo\"\n}\n\ndef check_error(response, link):\n    if not 200 <= response.status_code <= 299:\n        try:\n            print(\"ERROR - with response json: \", response.json(), link)\n        except json.JSONDecodeError:\n            print(\"ERROR - with response: \", response, link)\n        raise requests.HTTPError(\"Raise for status > 299\")\n\n\ndef main(should_deploy_site, site_url, identifier, destination_base_url, service):\n    site_url = site_url.rstrip('/')\n    destination_base_url = destination_base_url.rstrip('/')\n    if should_deploy_site:\n        url = f\"{site_url}/api/servicetools/v1/service/{identifier}\"\n        print(\"Updating site at url: \",url)\n        response = requests.put(url=url, auth=basic_auth_site)\n        check_error(response, url)\n        print(f\"Service url just created: {response.json()}\")\n        data = json.dumps({ \"url\": f\"{destination_base_url}/it/servizi/{service['slug']}/access\" })\n        response = requests.put(url=f\"{url}/access_url\", data=data, auth=basic_auth_site)\n        check_error(response, f\"{url}/access_url\")\n        if service['booking_call_to_action']:\n            data = json.dumps({\"url\": service['booking_call_to_action']})\n            response = requests.put(url=f\"{url}/booking_call_to_action\", data=data, auth=basic_auth_site)\n            check_error(response, f\"{url}/booking_call_to_action\")",
                                "language": "python3",
                                "input_transforms": {
                                    "service": {
                                        "expr": "results.j",
                                        "type": "javascript"
                                    },
                                    "site_url": {
                                        "expr": "flow_input.input_site_url",
                                        "type": "javascript"
                                    },
                                    "identifier": {
                                        "expr": "flow_input.iter.value",
                                        "type": "javascript"
                                    },
                                    "should_deploy_site": {
                                        "expr": "flow_input.should_deploy_site",
                                        "type": "javascript"
                                    },
                                    "destination_base_url": {
                                        "expr": "flow_input.destination_base_url",
                                        "type": "javascript"
                                    }
                                }
                            },
                            "summary": "Aggiorna sito"
                        }
                    ],
                    "iterator": {
                        "expr": "flow_input.services_to_deploy",
                        "type": "javascript"
                    },
                    "parallel": false,
                    "skip_failures": true
                }
            }
        ]
    },
    "schema": {
        "$schema": "https://json-schema.org/draft/2020-12/schema",
        "properties": {
            "source_base_url": {
                "type": "string",
                "description": "",
                "default": "https://servizi.comune.bugliano.pi.it/lang",
                "pattern": "[^/]$"
            },
            "destination_base_url": {
                "type": "string",
                "description": "",
                "default": "https://www2.stanzadelcittadino.it/comune-di-",
                "pattern": "[^/]$"
            },
            "destination_from_builder_url": {
                "type": "string",
                "description": "",
                "default": "https://form-builder.stanzadelcittadino.it/api/form",
                "pattern": "[^/]$"
            },
            "destination_from_url": {
                "type": "string",
                "description": "",
                "default": "https://form.stanzadelcittadino.it",
                "pattern": "[^/]$"
            },
            "USERNAME_DEFAULT_OPERATOR": {
                "type": "string",
                "description": "",
                "default": "urp",
                "format": ""
            },
            "API_ADMIN": {
                "type": "object",
                "description": "",
                "default": {
                    "username": "api",
                    "password": "G4Rv4U75@!5WTx"
                },
                "format": ""
            },
            "PROTOCOL_DEFAULT": {
                "type": "object",
                "description": "",
                "default": {
                    "protocol_required": "1",
                    "protocol_handler": "pec",
                    "receiver": "urp.blackhole@opencontent.it",
                    "send_attachment": "1"
                },
                "format": ""
            },
            "services_to_deploy": {
                "type": "array",
                "description": "",
                "default": [
                    "oc-cct-1",
                    "oc-cct-10",
                    "oc-cct-11",
                    "oc-cct-12",
                    "oc-cct-13",
                    "oc-cct-14",
                    "oc-cct-15",
                    "oc-cct-16",
                    "oc-cct-17",
                    "oc-cct-17-var-sgn",
                    "oc-cct-2",
                    "oc-cct-4",
                    "oc-cct-5",
                    "oc-cct-6",
                    "oc-cct-7",
                    "oc-cct-8",
                    "oc-cct-9",
                    "oc-pnrr-1",
                    "oc-pnrr-11-var-cct",
                    "oc-pnrr-15",
                    "oc-pnrr-16",
                    "oc-pnrr-19",
                    "oc-pnrr-19-var-sgn",
                    "oc-pnrr-2",
                    "oc-pnrr-4",
                    "oc-pnrr-6",
                    "oc-cct-1bis",
                    "oc-cct-16bis",
                    "oc-pnrr-2bis"
                ],
                "format": ""
            },
            "override_destination_form": {
                "type": "boolean",
                "description": "If true the flow will completely override the destination form",
                "default": "",
                "format": ""
            },
            "should_deploy_site": {
                "type": "boolean",
                "description": "",
                "default": "",
                "format": ""
            },
            "input_site_url": {
                "type": "string",
                "description": "Url del sito comunale di destinazione",
                "default": "https://nome.pnrr.comunweb.it",
                "pattern": "[^/]$"
            }
        },
        "required": [
            "services_to_deploy"
        ],
        "type": "object"
    }
}