<?xml version="1.0" encoding="utf-8"?>
<!-- Generator: Adobe Illustrator 19.0.0, SVG Export Plug-In . SVG Version: 6.00 Build 0)  -->
<svg version="1.1" id="Layer_1" xmlns="http://www.w3.org/2000/svg" xmlns:xlink="http://www.w3.org/1999/xlink" x="0px" y="0px"
	 viewBox="0 0 512 512" style="enable-background:new 0 0 512 512;" xml:space="preserve">
<g id="XMLID_1_">
	<path id="XMLID_7_" d="M160.1,512h64.2c5.6,0,10.2-4.7,10.2-10.2V10.2c0-5.6-4.7-10.2-10.2-10.2h-64.2c-5.6,0-10.2,4.7-10.2,10.2
		v490.6C148.9,507.3,154.5,512,160.1,512z M31.7,512h64.2c5.6,0,10.2-4.7,10.2-10.2V309.1c0-5.6-4.7-10.2-10.2-10.2H31.7
		c-5.6,0-10.2,4.7-10.2,10.2v191.8C21.4,507.3,26.1,512,31.7,512z M288.6,512h63.3c5.6,0,11.2-4.7,11.2-11.2V224.3
		c0-5.6-4.7-11.2-11.2-11.2h-63.3c-5.6,0-11.2,4.7-11.2,11.2v277.4C277.4,507.3,282.1,512,288.6,512L288.6,512z M404.9,95.9v404.9
		c0,5.6,4.7,11.2,11.2,11.2h63.3c5.6,0,11.2-4.7,11.2-11.2V95.9c0-5.6-4.7-11.2-11.2-11.2h-63.3C410.5,85.6,404.9,90.3,404.9,95.9z"
		/>
</g>
</svg>
