[
    {
        "parentCategoryId": 644,
        "parentCategoryName": "Ambiente",
        "parent_label": 0
    },
    {
        "parentCategoryId": 650,
        "parentCategoryName": "Facility Management",
        "parent_label": 1
    },
    {
        "parentCategoryId": 677,
        "parentCategoryName": "Polizia Locale",
        "parent_label": 2
    },
    {
        "parentCategoryId": 775,
        "parentCategoryName": "Mobilit\u00e0",
        "parent_label": 3
    },
    {
        "parentCategoryId": 1266,
        "parentCategoryName": "Municipi Manutenzioni",
        "parent_label": 4
    }
]