<?xml version="1.0" encoding="UTF-8"?>
<svg viewBox="0 0 744.09448819 1052.3622047" xmlns="http://www.w3.org/2000/svg" xmlns:xlink="http://www.w3.org/1999/xlink">
 <defs>
  <filter id="s">
   <feGaussianBlur stdDeviation=".7044"/>
  </filter>
  <filter id="b">
   <feGaussianBlur stdDeviation=".5205"/>
  </filter>
  <filter id="r">
   <feGaussianBlur stdDeviation="1.16"/>
  </filter>
  <linearGradient id="d">
   <stop stop-color="#fff" offset="0"/>
   <stop stop-color="#fff" stop-opacity="0" offset="1"/>
  </linearGradient>
  <linearGradient id="c">
   <stop stop-color="#fff" stop-opacity="0" offset="0"/>
   <stop stop-color="#fff" offset=".5"/>
   <stop stop-color="#fff" stop-opacity="0" offset="1"/>
  </linearGradient>
  <linearGradient id="a">
   <stop offset="0"/>
   <stop stop-color="#888282" offset=".1197"/>
   <stop stop-color="#a26767" offset=".1782"/>
   <stop stop-color="#b3adad" offset=".3223"/>
   <stop stop-color="#fdfafa" offset=".4609"/>
   <stop stop-color="#ba8c8c" offset=".7245"/>
   <stop offset="1"/>
  </linearGradient>
  <linearGradient id="q" x1="394.14" x2="392.35" y1="953.65" y2="911.55" gradientUnits="userSpaceOnUse">
   <stop stop-color="#b3b3b3" offset="0"/>
   <stop stop-color="#b3b3b3" stop-opacity="0" offset="1"/>
  </linearGradient>
  <linearGradient id="n" x1="360.12" x2="434.25" gradientUnits="userSpaceOnUse">
   <stop offset="0"/>
   <stop stop-color="#888282" offset=".0371"/>
   <stop stop-color="#a26767" offset=".2152"/>
   <stop stop-color="#b3adad" offset=".3746"/>
   <stop stop-color="#fdfafa" offset=".4946"/>
   <stop stop-color="#ba8c8c" offset=".7616"/>
   <stop offset="1"/>
  </linearGradient>
  <linearGradient id="m" x1="377.1" x2="416.55" gradientUnits="userSpaceOnUse">
   <stop stop-color="#4d4d4d" offset="0"/>
   <stop stop-color="#bfb9b9" offset=".1017"/>
   <stop stop-color="#9b9b9b" offset=".1883"/>
   <stop stop-color="#feefef" offset=".3613"/>
   <stop stop-color="#fff" offset=".4441"/>
   <stop stop-color="#b7aeae" offset=".5893"/>
   <stop stop-color="#a3a3a3" offset=".6722"/>
   <stop stop-color="#4d4d4d" offset="1"/>
  </linearGradient>
  <linearGradient id="j" x1="348.16" x2="445.04" y1="591.94" y2="591.69" gradientTransform="matrix(.74967 0 0 1.0861 100.38 -47.311)" gradientUnits="userSpaceOnUse">
   <stop offset="0"/>
   <stop stop-color="#888282" offset=".1197"/>
   <stop stop-color="#a26767" offset=".1782"/>
   <stop stop-color="#b3adad" offset=".3223"/>
   <stop stop-color="#fdfafa" offset=".4609"/>
   <stop stop-color="#e2cece" offset=".566"/>
   <stop stop-color="#ba8c8c" offset=".7245"/>
   <stop offset="1"/>
  </linearGradient>
  <linearGradient id="p" x1="381.5" x2="412.5" gradientUnits="userSpaceOnUse" xlink:href="#c"/>
  <linearGradient id="o" x1="389.75" x2="406.38" gradientUnits="userSpaceOnUse" xlink:href="#c"/>
  <linearGradient id="l" x1="367.23" x2="426.78" gradientUnits="userSpaceOnUse" xlink:href="#a"/>
  <linearGradient id="k" x1="352.33" x2="441.3" y1="592.44" y2="591.94" gradientTransform="matrix(.72555 0 0 1.0861 109.8 -80.789)" gradientUnits="userSpaceOnUse" xlink:href="#a"/>
  <linearGradient id="i" x1="353.03" x2="438.17" y1="890.74" y2="890.94" gradientTransform="matrix(.97896 0 0 2.7116 8.7048 -1543.5)" gradientUnits="userSpaceOnUse" xlink:href="#a"/>
  <linearGradient id="h" x1="364.41" x2="429.65" gradientUnits="userSpaceOnUse" xlink:href="#a"/>
  <linearGradient id="g" x1="397.22" x2="397.04" y1="176.43" y2="190.58" gradientUnits="userSpaceOnUse" xlink:href="#d"/>
  <radialGradient id="f" cx="177.43" cy="163.29" r="131.22" gradientTransform="matrix(1.1282 -.01792 .01588 .99987 -25.436 3.203)" gradientUnits="userSpaceOnUse">
   <stop stop-color="#999" stop-opacity="0" offset="0"/>
   <stop stop-color="#999" stop-opacity=".8392" offset=".8965"/>
   <stop stop-color="#4d4d4d" offset="1"/>
  </radialGradient>
  <radialGradient id="e" cx="397.22" cy="165.66" r="14.007" gradientTransform="matrix(1 0 0 1.3635 0 -60.209)" gradientUnits="userSpaceOnUse" xlink:href="#d"/>
 </defs>
 <path d="m394.21 191.33 0.66291-5.0381c1.5241 0.47355 3.1616 0.56887 5.0381-0.13259l0.53033 5.3917z" fill="#4d4d4d"/>
 <path d="m394.21 191.33 0.66291-5.0381c1.5241 0.47355 3.1616 0.56887 5.0381-0.13259l0.53033 5.3917z" fill="url(#g)"/>
 <path d="m389.75 210.11 2.75-19.75c5.3158 1.0255 7.8969 0.34182 10.625-0.25l3 20c-5.4583 0.50602-10.917 1.6874-16.375 0z" fill="#1a1a1a"/>
 <path transform="matrix(1.024 0 0 1 -9.2806 -2.625)" d="m427.5 781.8a31.188 7.8125 0 1 1 -62.375 0 31.188 7.8125 0 1 1 62.375 0z" fill="#1a1a1a"/>
 <path transform="matrix(.53675 0 0 1.0861 184.34 -414.01)" d="m432.6256,577.14196c-22.20459,2.12037-45.99292,2.83982-73.42104.35489v24.54398c0,.20932.0518.40525.11472.59621-.12523.15597-.1912.32249-.1912.48264 0,2.56241 16.45156,4.62773 36.71052,4.62773s36.67228-2.06532 36.67228-4.62773c0-.1079-.0192-.22043-.0765-.32649 .12414-.23577.1912-.486.1912-.75236v-24.89887z" fill="#73716f" filter="url(#b)" opacity=".7623"/>
 <path transform="matrix(1.4159 0 0 1.5516 -162.45 -478.6)" d="m450 925.36a55.75 23 0 1 1 -111.5 0 55.75 23 0 1 1 111.5 0z" fill="#b3b3b3"/>
 <path transform="matrix(1.2483 0 0 1.3679 -96.382 -312.88)" d="m450 925.36a55.75 23 0 1 1 -111.5 0 55.75 23 0 1 1 111.5 0z" filter="url(#r)" opacity=".9959"/>
 <path d="m415.25 209.87c0.0927 0.12543 0.18055 0.2552 0.26474 0.38693-0.0845-0.13193-0.17173-0.26135-0.26474-0.38693zm1.1608 2.5049c-1.1414 3.3056-9.379 5.8651-19.387 5.8651-9.8991 0-18.065-2.51-19.347-5.7633-0.10994 0.49204-0.15354 1.0013-0.16292 1.5274l-13.034 730.93c-9e-3 0.50042 0.046 0.96896 0.10177 1.4256-0.11115 0.37293-0.1697 0.77109-0.1697 1.154 0 6.1268 14.602 11.065 32.584 11.065s32.55-4.9382 32.55-11.065c0-0.258-0.017-0.52705-0.0679-0.78065 0.11018-0.56373 0.18106-1.1622 0.16971-1.7989l-13.034-730.93c-0.01-0.56279-0.0783-1.1058-0.20365-1.6292z" fill="url(#h)"/>
 <path transform="matrix(.97896 0 0 2.7116 8.5317 -1545.9)" d="m432.63 857.16c-22.205 4.6678-45.993 6.2516-73.421 0.78125v54.031c0 0.46081 0.0518 0.89212 0.11472 1.3125-0.12523 0.34336-0.1912 0.70994-0.1912 1.0625 0 5.6409 16.452 10.188 36.711 10.188s36.672-4.5466 36.672-10.188c0-0.23754-0.0192-0.48526-0.0765-0.71875 0.12414-0.51902 0.1912-1.0699 0.1912-1.6562v-54.812z" filter="url(#s)" opacity=".668"/>
 <path transform="matrix(1.2117 0 0 1.2381 -81.844 -195.69)" d="m450 925.36a55.75 23 0 1 1 -111.5 0 55.75 23 0 1 1 111.5 0z" fill="url(#q)" opacity=".9959"/>
 <path d="m432.23 780.69c-27.882 11.505-41.185 9.6554-71.876 2.1184v146.51c0 1.2495 0.0507 2.419 0.11229 3.5589-0.12259 0.93105-0.18718 1.925-0.18718 2.881 0 15.296 16.105 24.552 35.938 24.552s35.901-9.2564 35.901-24.552c0-0.64409-0.0188-1.3158-0.075-1.9489 0.12153-1.4074 0.18719-2.9011 0.18719-4.491v-148.63z" fill="url(#i)"/>
 <path transform="matrix(.67537 0 0 1.0861 128.36 -45.583)" d="m432.6256,577.14196c-22.20459,2.12037-45.99292,2.83982-73.42104.35489v24.54398c0,.20932.0518.40525.11472.59621-.12523.15597-.1912.32249-.1912.48264 0,2.56241 16.45156,4.62773 36.71052,4.62773s36.67228-2.06532 36.67228-4.62773c0-.1079-.0192-.22043-.0765-.32649 .12414-.23577.1912-.486.1912-.75236v-24.89887z" filter="url(#b)" opacity=".7623"/>
 <path d="m424.70181,579.54209c-16.64611,2.303-33.48482,3.66043-54.04683.96147l-.99468,26.08201c-.009.2272.0388.44016.0859.64756-.0938.16941-.14334.35027-.14334.52421 0,2.78312 12.33324,5.02633 27.52075,5.02633s27.49208-2.24321 27.49208-5.02633c0-.11719-.0143-.23941-.0573-.35461 .0931-.25607.14332-.52786.14332-.81716l-.99467-27.04348z" fill="url(#j)"/>
 <path transform="matrix(.66906 0 0 1.0861 131.97 -79.253)" d="m432.6256,577.14196c-22.20459,2.12037-45.99292,2.83982-73.42104.35489v24.54398c0,.20932.0518.40525.11472.59621-.12523.15597-.1912.32249-.1912.48264 0,2.56241 16.45156,4.62773 36.71052,4.62773s36.67228-2.06532 36.67228-4.62773c0-.1079-.0192-.22043-.0765-.32649 .12414-.23577.1912-.486.1912-.75236v-24.89887z" filter="url(#b)" opacity=".7623"/>
 <path d="m423.69 546.06c-16.11 2.303-32.41 3.0844-52.31 0.38546l-0.96001 26.658c-9e-3 0.2272 0.0376 0.44016 0.0833 0.64756-0.0908 0.16941-0.13873 0.35027-0.13873 0.52421 0 2.7831 11.936 5.0263 26.635 5.0263s26.607-2.2432 26.607-5.0263c0-0.11719-0.0139-0.23941-0.0555-0.35461 0.09-0.25607 0.13874-0.52786 0.13874-0.81716l-1.152-26.851z" fill="url(#k)"/>
 <path transform="matrix(.53887 0 0 1.0861 183.99 -380.34)" d="m432.6256,577.14196c-22.20459,2.12037-45.99292,2.83982-73.42104.35489v24.54398c0,.20932.0518.40525.11472.59621-.12523.15597-.1912.32249-.1912.48264 0,2.56241 16.45156,4.62773 36.71052,4.62773s36.67228-2.06532 36.67228-4.62773c0-.1079-.0192-.22043-.0765-.32649 .12414-.23577.1912-.486.1912-.75236v-24.89887z" filter="url(#b)" opacity=".7623"/>
 <path d="m419.4 245.97c-13.575 2.303-27.102 3.8524-43.871 1.1535l-1.0165 25.89c-9e-3 0.22719 0.0317 0.44015 0.0702 0.64756-0.0766 0.1694-0.1169 0.35027-0.1169 0.52421 0 2.7831 10.058 5.0263 22.444 5.0263s22.42-2.2432 22.42-5.0263c0-0.11719-0.0117-0.23942-0.0468-0.35461 0.0759-0.25608 0.11689-0.52786 0.11689-0.81716l-1.2198-27.043z" fill="url(#l)"/>
 <path d="m416.54824,212.30356c-11.91837,2.30301-24.68677,3.08442-39.40888.38546v26.65802c0,.22735.0277.44016.0616.64756-.0672.16941-.10264.35027-.10264.52421 0,2.78312 8.83039,5.02633 19.70441,5.02633s19.68392-2.24321 19.68392-5.02633c0-.11719-.0109-.23941-.0411-.35461 .0665-.25607.10264-.52786.10264-.81716v-27.04348z" fill="url(#m)"/>
 <path d="m392.625,772.15625c-.48661.0131-.95679.0444-1.4375.0625 .701-.0259 1.40924-.0467 2.125-.0625-.22801.005-.46071-.006-.6875,0zm-5.5625.28125c-.71417.0499-1.42886.0953-2.125.15625 .70033-.0595 1.4016-.10738 2.125-.15625zm-13.09375,1.71875c-.71193.14801-1.39509.3073-2.0625.46875 .65087-.17132 1.34006-.31182 2.0625-.46875zm-2.0625.46875c-7.22755,1.74833-11.78125,4.26917-11.78125,7.0625 0,5.28122 16.2017,9.5625 36.1875,9.5625s36.1875-4.28128 36.1875-9.5625c0-2.24508-2.94192-4.30591-7.84375-5.9375 2.45831.983 3.84375,2.11516 3.84375,3.3125 0,3.83148-14.29891,6.9375-31.9375,6.9375s-31.9375-3.10602-31.9375-6.9375c0-1.67627 2.72518-3.23829 7.28125-4.4375z" fill="url(#n)"/>
 <path d="m389.75 210.11 2.792-19.75c5.3969 1.0255 8.0175 0.34182 10.787-0.25l3.0458 20c-5.5417 0.50602-11.083 1.6874-16.625 0z" fill="url(#o)"/>
 <path d="m381.5 213.99 0.375-8.5c5.8862 3.7237 20.93 4.6112 30.375-0.375l0.25 9.125c-10.136 0.80495-20.219 1.8481-31-0.25z" fill="#1a1a1a"/>
 <path d="m397.22 144.44c-8.5915 0-15.562 8.3562-15.562 18.656 0 7.4875 3.6897 13.938 9 16.906l0.0312 0.21875c0.34841 2.388 4.4062 6.2812 4.4062 6.2812l4.1562 0.375s4.1284-3.8948 5.0285-6.5205c5.8899-2.6559 8.5028-9.2711 8.5028-17.261 0-10.3-6.971-18.656-15.562-18.656z" fill="#ccc"/>
 <path d="m397.22 146.56c-7.7326 0-14.007 7.5208-14.007 16.791 0 6.7389 3.3208 12.545 8.1002 15.216 8e-3 0.0543 0.0204 0.14431 0.0281 0.19688 0.31357 2.1492 3.9657 5.6533 3.9657 5.6533l3.7407 0.33751s3.7157-3.5054 4.5258-5.8686c5.3011-2.3904 7.6527-8.3442 7.6527-15.535 0-9.2703-6.2741-16.791-14.007-16.791z" fill="url(#e)"/>
 <path d="m397.04 186.69 5.8336-27.754" fill="#808080" stroke="#999" stroke-width=".5"/>
 <path d="m396.33 188.1-3.7123-27.224" fill="#808080" stroke="#999" stroke-width=".5"/>
 <path d="m392.75,161.54968c-.0341-.20849-.005-.42683.0813-.61944s.23136-.35873.41013-.47129 .39107-.17113.60227-.16614c.2112.005.42049.0735.59375.19437 .10133.0707.18983.15819.28876.23221s.21289.13573.33624.14279c.12555.007.2488-.0435.35137-.11629s.18774-.16686.27363-.25871c.10726-.1147.21983-.22923.36023-.29958 .0702-.0352.14688-.0587.22529-.0629s.15857.0114.22698.0499c.0981.0553.16463.15157.23484.23963 .0351.044.0722.087.11576.12259s.0942.0639.1494.0753 .12452.004.18165-.0197 .10762-.0617.14971-.10701c.0842-.0905.13416-.20691.18054-.32151s.0919-.23204.16971-.32815c.0389-.0481.0857-.0902.14013-.11962s.11658-.0455.17826-.0415c.021.001.0418.005.0627.007l.0623-.007 .0471-.0329c.013-.0143.0231-.031.0316-.0484 .017-.0347.0277-.0724.0463-.10628 .0317-.0581.0858-.10279.14725-.12749s.12983-.03.1953-.02c.13094.02.24593.0985.34259.18908s.17982.19488.27826.28351 .2172.1628.3491.17495 .25073-.0346.375-.0625c.0885-.0199.17909-.0306.26645-.0551s.17329-.0645.23355-.13235c.0451-.0507.0734-.11436.0933-.17929s.0319-.13195.0486-.19775 .0386-.13127.0759-.18795 .0918-.10429.15724-.12251c.0503-.014.10488-.01.15411.008s.0933.0479.13034.0847c.074.0737.11918.17095.1613.26658s.0839.19375.15318.27197c.0346.0391.0761.0727.12346.0948s.10092.032.15261.0244 .0938-.0294.13299-.0588 .0727-.0656.10391-.10335c.0624-.0755.11856-.15937.2006-.21286 .0537-.035.11613-.0551.17938-.0657s.12766-.0119.19179-.0119c.12826-6e-005 .26141.004.37883-.0474 .0824-.0362.15257-.0994.19719-.1775s.0634-.17068.0528-.26" fill="#808080" stroke="#999" stroke-width=".25"/>
 <path d="m381.5 213.99 0.375-8.5c5.8862 3.7237 20.93 4.6112 30.375-0.375l0.25 9.125c-10.136 0.80495-20.219 1.8481-31-0.25z" fill="url(#p)"/>
 <path transform="matrix(.57578 0 0 .57578 296.21 37.582)" d="m309.41 179.79a131.22 131.22 0 1 1 -262.43 0 131.22 131.22 0 1 1 262.43 0z" fill="url(#f)" opacity=".2951"/>
</svg>
