<?xml version="1.0" encoding="UTF-8" standalone="no"?>
<!-- Created with Inkscape (http://www.inkscape.org/) -->

<svg
   width="247.91689"
   height="49.272167"
   viewBox="0 0 247.91689 49.272167"
   version="1.1"
   id="svg1"
   inkscape:version="1.3.2 (091e20ef0f, 2023-11-25)"
   sodipodi:docname="wideboard-wordmark.svg"
   xmlns:inkscape="http://www.inkscape.org/namespaces/inkscape"
   xmlns:sodipodi="http://sodipodi.sourceforge.net/DTD/sodipodi-0.dtd"
   xmlns="http://www.w3.org/2000/svg"
   xmlns:svg="http://www.w3.org/2000/svg">
  <sodipodi:namedview
     id="namedview1"
     pagecolor="#ffffff"
     bordercolor="#000000"
     borderopacity="0.25"
     inkscape:showpageshadow="false"
     inkscape:pageopacity="0.0"
     inkscape:pagecheckerboard="false"
     inkscape:deskcolor="#ffffff"
     inkscape:document-units="px"
     showgrid="false"
     inkscape:zoom="2.21875"
     inkscape:cx="108.84507"
     inkscape:cy="67.380282"
     inkscape:window-width="1920"
     inkscape:window-height="1011"
     inkscape:window-x="0"
     inkscape:window-y="0"
     inkscape:window-maximized="1"
     inkscape:current-layer="layer1"
     showguides="false"
     inkscape:export-bgcolor="#ffffff00">
    <inkscape:grid
       id="grid1"
       units="px"
       originx="-979.86876"
       originy="-198.07341"
       spacingx="12"
       spacingy="12"
       empcolor="#0099e5"
       empopacity="0.30196078"
       color="#0099e5"
       opacity="0.14901961"
       empspacing="4"
       dotted="false"
       gridanglex="30"
       gridanglez="30"
       visible="false" />
    <inkscape:page
       x="0"
       y="0"
       width="247.91689"
       height="49.272167"
       id="page28"
       margin="0"
       bleed="0"
       inkscape:export-filename="wideboard-wordmark.png"
       inkscape:export-xdpi="974.18079"
       inkscape:export-ydpi="974.18079" />
  </sodipodi:namedview>
  <defs
     id="defs1" />
  <g
     inkscape:label="Layer 1"
     inkscape:groupmode="layer"
     id="layer1"
     transform="translate(-979.86876,-198.07341)">
    <text
       xml:space="preserve"
       style="font-style:normal;font-variant:normal;font-weight:bold;font-stretch:normal;font-size:14.6667px;line-height:1;font-family:Inter;-inkscape-font-specification:'Inter Bold';text-align:start;letter-spacing:-1px;text-anchor:start;fill:#e01b24;fill-opacity:1;stroke:#e01b24;stroke-width:3.77953;stroke-linejoin:round;stroke-dasharray:none;stroke-opacity:1"
       x="772.74652"
       y="548.71808"
       id="text43"><tspan
         sodipodi:role="line"
         id="tspan43"
         x="772.74652"
         y="548.71808" /></text>
    <g
       id="g22"
       style="fill:#000000;fill-opacity:1;stroke-width:1.13855"
       transform="matrix(0.31805292,0,0,0.31805292,190.1314,200.72962)" />
    <g
       id="g63"
       transform="matrix(0.27688273,0,0,0.27688273,671.22005,-507.67437)"
       style="fill:#040e1c;fill-opacity:1;stroke-width:3.61164">
      <path
         id="path60"
         style="fill:#040e1c;fill-opacity:1;stroke-width:36.1164;stroke-linejoin:round"
         d="m 1491.1028,2548.905 a 199.04903,49.762226 0 0 1 -88.6633,27.2179 v 112.8721 a 199.04903,49.762226 0 0 1 88.6633,26.8897 v -21.613 a 172.96349,36.719454 0 0 0 -77.0448,-20.0824 v -83.2771 a 172.96349,36.719454 0 0 0 77.0448,-20.0782 z" />
      <path
         id="path61"
         style="fill:#040e1c;fill-opacity:1;stroke-width:36.1164;stroke-linejoin:round"
         d="m 1114.7272,2548.9092 v 21.9248 a 172.96349,36.719454 0 0 0 77.0448,20.0782 v 83.2771 a 172.96349,36.719454 0 0 0 -77.0448,20.0824 v 21.9207 a 199.04903,49.762226 0 0 1 88.6634,-27.2138 v -112.8557 a 199.04903,49.762226 0 0 1 -88.6634,-27.2137 z" />
      <path
         id="path62"
         style="color:#000000;fill:#040e1c;fill-opacity:1;stroke-width:3.61164;-inkscape-stroke:none"
         d="m 1291.4783,2672.6238 -43.6289,43.629 10.6074,10.6054 44.459,-44.459 44.459,44.459 10.6054,-10.6054 -41.09,-41.0917 z"
         sodipodi:nodetypes="cccccccc" />
      <path
         id="path63"
         style="fill:#040e1c;fill-opacity:1;stroke-width:36.1164;stroke-linejoin:round"
         d="m 1228.2717,2579.1316 v 79.9849 c 23.7095,-2.4072 49.0533,-3.6488 74.6434,-3.6569 25.5869,0 50.9305,1.2417 74.6433,3.6447 v -79.9727 c -23.7095,2.4072 -49.0532,3.6488 -74.6433,3.6569 -25.5901,-0.01 -50.9339,-1.2497 -74.6434,-3.6569 z m 0,90.2548 v 16.5835 c 23.7095,-2.4072 49.0533,-3.6488 74.6434,-3.6569 25.5869,0 50.9305,1.2417 74.6433,3.6447 v -16.5833 c -43.4279,-4.4009 -97.1508,-5.2811 -149.2867,0.012 z"
         sodipodi:nodetypes="ccccccccccccc" />
      <path
         d="m 1561.339,2670.222 -20.4078,-74.6344 h 9.1835 l 15.5974,60.7862 h 0.729 l 15.889,-60.7862 h 10.2039 l 15.889,60.7862 h 0.729 l 15.5974,-60.7862 h 9.1835 l -20.4079,74.6344 h -9.3293 l -16.472,-59.4744 h -0.5824 l -16.472,59.4744 z m 76.6868,0 v -55.9759 h 8.6005 v 55.9759 z m 4.3732,-65.3052 q -2.5145,0 -4.3367,-1.7127 -1.7857,-1.7129 -1.7857,-4.1181 0,-2.4052 1.7857,-4.118 1.8222,-1.7128 4.3367,-1.7128 2.5146,0 4.3002,1.7128 1.8221,1.7128 1.8221,4.118 0,2.4052 -1.8221,4.1181 -1.7856,1.7127 -4.3002,1.7127 z m 35.1421,66.4714 q -6.9969,0 -12.354,-3.535 -5.3569,-3.5713 -8.3818,-10.0581 -3.0247,-6.5233 -3.0247,-15.4153 0,-8.819 3.0247,-15.3058 3.0249,-6.4868 8.4183,-10.0218 5.3935,-3.5349 12.4633,-3.5349 5.4664,0 8.6369,1.8221 3.207,1.7857 4.8834,4.0816 1.7128,2.2594 2.6603,3.7172 h 0.729 v -27.5506 h 8.6005 v 74.6344 h -8.3089 v -8.6005 h -1.0208 q -0.9476,1.5307 -2.6968,3.8629 -1.7492,2.2959 -4.9926,4.118 -3.2434,1.7858 -8.637,1.7858 z m 1.1661,-7.7259 q 5.1749,0 8.7463,-2.6967 3.5714,-2.7333 5.4299,-7.5436 1.8586,-4.847 1.8586,-11.188 0,-6.2681 -1.8221,-10.9692 -1.8221,-4.7375 -5.3935,-7.3614 -3.5714,-2.6603 -8.8192,-2.6603 -5.4664,0 -9.1106,2.8061 -3.6079,2.7696 -5.43,7.5437 -1.7856,4.7375 -1.7856,10.6411 0,5.9767 1.8221,10.8599 1.8585,4.847 5.4664,7.7259 3.6442,2.8425 9.0377,2.8425 z m 58.9029,7.7259 q -8.0902,0 -13.9574,-3.5715 -5.8309,-3.6077 -9.0014,-10.0581 -3.1341,-6.4868 -3.1341,-15.0872 0,-8.6005 3.1341,-15.1602 3.1705,-6.596 8.8191,-10.2768 5.685,-3.7171 13.2651,-3.7171 4.3731,0 8.6369,1.4577 4.2638,1.4577 7.7622,4.7375 3.4986,3.2434 5.5758,8.6005 2.0772,5.3571 2.0772,13.1922 v 3.6443 h -43.148 v -7.4343 h 34.4019 q 0,-4.7376 -1.8951,-8.4547 -1.8586,-3.7172 -5.3207,-5.8673 -3.4255,-2.1501 -8.0902,-2.1501 -5.1384,0 -8.8919,2.551 -3.7172,2.5146 -5.7216,6.5597 -2.0043,4.0451 -2.0043,8.6734 v 4.9561 q 0,6.341 2.1866,10.7506 2.223,4.373 6.1588,6.6689 3.9357,2.2595 9.147,2.2595 3.3892,0 6.1223,-0.9475 2.7698,-0.9835 4.7741,-2.9154 2.0043,-1.9679 3.0976,-4.8834 l 8.3089,2.3324 q -1.312,4.2273 -4.4096,7.4343 -3.0976,3.1705 -7.6528,4.9561 -4.5554,1.7494 -10.2405,1.7494 z m 31.498,-1.1661 v -74.6344 h 8.6005 v 27.5506 h 0.7289 q 0.9476,-1.4578 2.6239,-3.7172 1.7128,-2.2958 4.8833,-4.0816 3.2069,-1.8221 8.6733,-1.8221 7.0699,0 12.4634,3.535 5.3935,3.5349 8.4182,10.0217 3.0249,6.4868 3.0249,15.3059 0,8.8919 -3.0249,15.4152 -3.0247,6.4868 -8.3818,10.0581 -5.357,3.535 -12.354,3.535 -5.3935,0 -8.6369,-1.7857 -3.2434,-1.8221 -4.9926,-4.118 -1.7492,-2.3323 -2.6968,-3.863 h -1.0207 v 8.6005 z m 8.4547,-27.9879 q 0,6.341 1.8585,11.1879 1.8586,4.8103 5.43,7.5436 3.5714,2.6967 8.7463,2.6967 5.3935,0 9.0012,-2.8425 3.6443,-2.8789 5.4664,-7.7259 1.8586,-4.8832 1.8586,-10.8598 0,-5.9037 -1.8221,-10.6412 -1.7857,-4.7741 -5.43,-7.5437 -3.6077,-2.806 -9.0741,-2.806 -5.2478,0 -8.8192,2.6602 -3.5713,2.624 -5.3935,7.3614 -1.8221,4.7012 -1.8221,10.9693 z m 70.8561,29.1541 q -7.5801,0 -13.3016,-3.6078 -5.685,-3.6079 -8.8919,-10.0947 -3.1706,-6.4868 -3.1706,-15.16 0,-8.7463 3.1706,-15.2695 3.2069,-6.5233 8.8919,-10.131 5.7215,-3.6079 13.3016,-3.6079 7.5801,0 13.2651,3.6079 5.7215,3.6077 8.892,10.131 3.207,6.5232 3.207,15.2695 0,8.6732 -3.207,15.16 -3.1705,6.4868 -8.892,10.0947 -5.685,3.6078 -13.2651,3.6078 z m 0,-7.7259 q 5.7579,0 9.4751,-2.9518 3.7171,-2.9519 5.5027,-7.7622 1.7858,-4.8105 1.7858,-10.4226 0,-5.6122 -1.7858,-10.459 -1.7856,-4.847 -5.5027,-7.8352 -3.7172,-2.9883 -9.4751,-2.9883 -5.758,0 -9.4751,2.9883 -3.7172,2.9882 -5.5028,7.8352 -1.7857,4.8468 -1.7857,10.459 0,5.6121 1.7857,10.4226 1.7856,4.8103 5.5028,7.7622 3.7171,2.9518 9.4751,2.9518 z m 48.9904,7.8716 q -5.3207,0 -9.6573,-2.0043 -4.3367,-2.0408 -6.8876,-5.8673 -2.5511,-3.8629 -2.5511,-9.3293 0,-4.8104 1.895,-7.7987 1.895,-3.0248 5.0655,-4.7375 3.1705,-1.7128 6.9971,-2.5511 3.8629,-0.8742 7.7622,-1.3847 5.1019,-0.6557 8.2724,-0.9835 3.207,-0.3638 4.6647,-1.2021 1.4942,-0.8382 1.4942,-2.9154 v -0.2918 q 0,-5.3935 -2.9519,-8.3819 -2.9154,-2.9883 -8.8555,-2.9883 -6.1588,0 -9.6573,2.6968 -3.4985,2.6967 -4.9197,5.7579 l -8.1631,-2.9154 q 2.1864,-5.1019 5.8307,-7.9444 3.6807,-2.8791 8.0174,-4.0088 4.3731,-1.166 8.6004,-1.166 2.6967,0 6.1953,0.6556 3.5349,0.6197 6.8148,2.5875 3.3163,1.9679 5.5027,5.9401 2.1866,3.9723 2.1866,10.6413 v 36.8799 h -8.6004 v -7.58 h -0.4372 q -0.8742,1.8221 -2.9154,3.8993 -2.0408,2.0773 -5.43,3.5349 -3.3892,1.4577 -8.2724,1.4577 z m 1.3118,-7.7258 q 5.1021,0 8.6005,-2.0044 3.535,-2.0043 5.3206,-5.1748 1.8222,-3.1705 1.8222,-6.669 v -7.8716 q -0.5464,0.6557 -2.4052,1.202 -1.8221,0.5104 -4.2274,0.9116 -2.3688,0.3651 -4.6282,0.6556 -2.223,0.2559 -3.6078,0.4371 -3.3527,0.4372 -6.2681,1.4213 -2.879,0.9475 -4.6647,2.8789 -1.7492,1.8951 -1.7492,5.175 0,4.4823 3.3163,6.7782 3.3526,2.2595 8.491,2.2595 z m 34.122,6.4139 v -55.9759 h 8.3089 v 8.4547 h 0.5824 q 1.5307,-4.1544 5.5393,-6.7418 4.0087,-2.5875 9.0378,-2.5875 0.9476,0 2.3688,0.039 1.4213,0.039 2.1501,0.1157 v 8.7463 q -0.4371,-0.1157 -2.0044,-0.3279 -1.5306,-0.2558 -3.2434,-0.2558 -4.0815,0 -7.2885,1.7128 -3.1705,1.6764 -5.029,4.6647 -1.8221,2.9518 -1.8221,6.7418 v 35.4223 z m 51.6144,1.1661 q -6.9969,0 -12.354,-3.535 -5.3571,-3.5713 -8.3818,-10.0581 -3.0247,-6.5233 -3.0247,-15.4153 0,-8.819 3.0247,-15.3058 3.0247,-6.4868 8.4182,-10.0218 5.3934,-3.5349 12.4634,-3.5349 5.4664,0 8.6369,1.8221 3.207,1.7857 4.8833,4.0816 1.7127,2.2594 2.6602,3.7172 h 0.729 v -27.5506 h 8.6004 v 74.6344 h -8.309 v -8.6005 h -1.0207 q -0.9476,1.5307 -2.6968,3.8629 -1.7492,2.2959 -4.9926,4.118 -3.2434,1.7858 -8.6369,1.7858 z m 1.1661,-7.7259 q 5.1748,0 8.7461,-2.6967 3.5714,-2.7333 5.43,-7.5436 1.8585,-4.847 1.8585,-11.188 0,-6.2681 -1.8221,-10.9692 -1.8221,-4.7375 -5.3935,-7.3614 -3.5713,-2.6603 -8.819,-2.6603 -5.4664,0 -9.1107,2.8061 -3.6078,2.7696 -5.43,7.5437 -1.7857,4.7375 -1.7857,10.6411 0,5.9767 1.8221,10.8599 1.8587,4.847 5.4665,7.7259 3.6443,2.8425 9.0378,2.8425 z"
         id="text63"
         style="font-size:7.98225px;line-height:1;font-family:Inter;-inkscape-font-specification:Inter;letter-spacing:-0.463972px;white-space:pre;inline-size:37.6198;fill:#040e1c;fill-opacity:1;stroke-width:3.61165;stroke-linejoin:round"
         aria-label="Wideboard" />
    </g>
    <text
       xml:space="preserve"
       style="font-style:normal;font-variant:normal;font-weight:800;font-stretch:normal;font-size:16px;line-height:1.15;font-family:Inter;-inkscape-font-specification:'Inter Ultra-Bold';text-align:start;letter-spacing:0px;text-anchor:start;fill:#1857a5;fill-opacity:1;stroke-width:2"
       x="1031.9747"
       y="201.01357"
       id="text77"><tspan
         sodipodi:role="line"
         id="tspan77"
         x="1031.9747"
         y="201.01357" /></text>
  </g>
</svg>
