[
{
  "model": "front.boundarykind",
  "pk": 1,
  "fields": {
    "name": "Oceanic",
    "reference": "oceanic",
    "description": "",
    "notes": "",
    "category": "wat"
  }
},
{
  "model": "front.boundarykind",
  "pk": 2,
  "fields": {
    "name": "River",
    "reference": "river",
    "description": "",
    "notes": "",
    "category": "wat"
  }
},
{
  "model": "front.boundarykind",
  "pk": 3,
  "fields": {
    "name": "Air",
    "reference": "air",
    "description": "",
    "notes": "",
    "category": "atm"
  }
},
{
  "model": "front.boundarykind",
  "pk": 4,
  "fields": {
    "name": "Waves",
    "reference": "waves",
    "description": "",
    "notes": "",
    "category": "wat"
  }
}
]
