{
    "display": "form",
    "components": [
        {
            "display": "form",
            "components": [
                {
                    "label": "Descrizione dell'ente",
                    "placeholder": "Comune di Bugliano",
                    "defaultValue": " ",
                    "clearOnHide": false,
                    "validate": {
                        "required": true
                    },
                    "key": "description",
                    "type": "textfield",
                    "input": true,
                    "hidden": true,
                    "tableView": true
                },
                {
                    "label": "UUID dell'ente",
                    "placeholder": "XXXXXXXX-XXXX-XXXX-XXXX-XXXXXXXXXXXX",
                    "clearOnHide": false,
                    "validate": {
                        "required": true
                    },
                    "key": "tenant_sdc_id",
                    "type": "textfield",
                    "input": true,
                    "hidden": true,
                    "tableView": true
                },
                {
                    "label": "UUID del Servizio",
                    "placeholder": "XXXXXXXX-XXXX-XXXX-XXXX-XXXXXXXXXXXX",
                    "clearOnHide": false,
                    "validate": {
                        "required": true
                    },
                    "key": "sdc_id",
                    "type": "textfield",
                    "input": true,
                    "hidden": true,
                    "tableView": true
                },
                {
                    "label": "Stati delle pratiche da protocollare",
                    "widget": "choicesjs",
                    "multiple": true,
                    "data": {
                        "values": [
                            {
                                "label": "Acquisita",
                                "value": "status_submitted"
                            },
                            {
                                "label": "Richiesta di integrazione",
                                "value": "status_request_integration"
                            },
                            {
                                "label": "Risposta integrazione",
                                "value": "status_submitted_after_integration"
                            },
                            {
                                "label": "Accettata",
                                "value": "status_complete"
                            },
                            {
                                "label": "Rifiutata",
                                "value": "status_cancelled"
                            },
                            {
                                "label": "Ritirata",
                                "value": "status_withdraw"
                            }
                        ]
                    },
                    "key": "application_states",
                    "type": "select",
                    "input": true,
                    "hidden": true,
                    "tableView": true
                },
                {
                    "label": "Configurazione",
                    "disableAddingRemovingRows": true,
                    "reorder": false,
                    "addAnotherPosition": "bottom",
                    "layoutFixed": false,
                    "enableRowGroups": false,
                    "initEmpty": false,
                    "hideLabel": true,
                    "defaultValue": [
                        {
                            "description": "",
                            "is_active": false,
                            "auth_username": "",
                            "auth_password": "",
                            "username": "",
                            "denomination": "",
                            "email": "",
                            "wsdl_url": "",
                            "registry_url": "",
                            "incoming_document_type": "",
                            "incoming_intermediary": "",
                            "incoming_sorting": "",
                            "incoming_classification": "",
                            "incoming_folder": "",
                            "response_internal_sender": "",
                            "response_document_type": "",
                            "response_intermediary": "",
                            "response_sorting": "",
                            "response_classification": "",
                            "response_folder": ""
                        }
                    ],
                    "validate": {
                        "required": true,
                        "minLength": "1",
                        "maxLength": "1"
                    },
                    "errorLabel": "Devi fornire almeno una configurazione",
                    "key": "configs",
                    "type": "datagrid",
                    "input": true,
                    "components": [
                        {
                            "key": "fieldSet",
                            "type": "fieldset",
                            "label": "Configurazione",
                            "input": false,
                            "components": [
                                {
                                    "label": "Descrizione del servizio",
                                    "placeholder": "Comune di Bugliano",
                                    "defaultValue": " ",
                                    "clearOnHide": false,
                                    "validate": {
                                        "required": true
                                    },
                                    "key": "description",
                                    "type": "textfield",
                                    "input": true,
                                    "hidden": true,
                                    "tableView": true
                                },
                                {
                                    "label": "Attivo",
                                    "defaultValue": false,
                                    "clearOnHide": false,
                                    "key": "is_active",
                                    "type": "checkbox",
                                    "input": true,
                                    "tableView": false
                                },
                                {
                                    "label": "Username Basic Auth",
                                    "tableView": true,
                                    "key": "auth_username",
                                    "type": "textfield",
                                    "input": true
                                },
                                {
                                    "label": "Password Basic Auth",
                                    "tableView": true,
                                    "key": "auth_password",
                                    "type": "textfield",
                                    "input": true
                                },
                                {
                                    "label": "Username",
                                    "tableView": true,
                                    "validate": {
                                        "required": true
                                    },
                                    "key": "username",
                                    "type": "textfield",
                                    "input": true
                                },
                                {
                                    "label": "Denominazione",
                                    "tableView": true,
                                    "validate": {
                                        "required": true
                                    },
                                    "key": "denomination",
                                    "type": "textfield",
                                    "input": true
                                },
                                {
                                    "label": "Email",
                                    "placeholder": "user@example.com",
                                    "tableView": true,
                                    "validate": {
                                        "required": true
                                    },
                                    "key": "email",
                                    "type": "email",
                                    "input": true
                                },
                                {
                                    "label": "Url wsdl",
                                    "placeholder": "https://www.example.com/service?wsdl",
                                    "tableView": true,
                                    "validate": {
                                        "required": true
                                    },
                                    "key": "wsdl_url",
                                    "type": "url",
                                    "input": true
                                },
                                {
                                    "label": "Url ws",
                                    "placeholder": "https://www.example.com/service",
                                    "tableView": true,
                                    "validate": {
                                        "required": true
                                    },
                                    "key": "registry_url",
                                    "type": "url",
                                    "input": true
                                },
                                {
                                    "label": "Tipo documento (Arrivo)",
                                    "tableView": true,
                                    "validate": {
                                        "required": true
                                    },
                                    "key": "incoming_document_type",
                                    "type": "textfield",
                                    "input": true
                                },
                                {
                                    "label": "Tramite (Arrivo)",
                                    "tableView": true,
                                    "validate": {
                                        "required": true
                                    },
                                    "key": "incoming_intermediary",
                                    "type": "textfield",
                                    "input": true
                                },
                                {
                                    "label": "Smistamento (Arrivo)",
                                    "tableView": true,
                                    "validate": {
                                        "required": true
                                    },
                                    "key": "incoming_sorting",
                                    "type": "textfield",
                                    "input": true
                                },
                                {
                                    "label": "Classifica (Arrivo)",
                                    "tableView": true,
                                    "validate": {
                                        "required": true
                                    },
                                    "key": "incoming_classification",
                                    "type": "textfield",
                                    "input": true
                                },
                                {
                                    "label": "Fascicolo (Arrivo)",
                                    "placeholder": "2022/4",
                                    "tableView": true,
                                    "validate": {
                                        "required": true
                                    },
                                    "key": "incoming_folder",
                                    "type": "textfield",
                                    "input": true
                                },
                                {
                                    "label": "Mittente interno (Risposta)",
                                    "tableView": true,
                                    "validate": {
                                        "required": true
                                    },
                                    "key": "response_internal_sender",
                                    "type": "textfield",
                                    "input": true
                                },
                                {
                                    "label": "Tipo documento (Risposta)",
                                    "tableView": true,
                                    "validate": {
                                        "required": true
                                    },
                                    "key": "response_document_type",
                                    "type": "textfield",
                                    "input": true
                                },
                                {
                                    "label": "Tramite (Risposta)",
                                    "tableView": true,
                                    "validate": {
                                        "required": true
                                    },
                                    "key": "response_intermediary",
                                    "type": "textfield",
                                    "input": true
                                },
                                {
                                    "label": "Smistamento (Risposta)",
                                    "tableView": true,
                                    "validate": {
                                        "required": true
                                    },
                                    "key": "response_sorting",
                                    "type": "textfield",
                                    "input": true
                                },
                                {
                                    "label": "Classifica (Risposta)",
                                    "tableView": true,
                                    "validate": {
                                        "required": true
                                    },
                                    "key": "response_classification",
                                    "type": "textfield",
                                    "input": true
                                },
                                {
                                    "label": "Fascicolo (Risposta)",
                                    "placeholder": "2022/4",
                                    "tableView": true,
                                    "validate": {
                                        "required": true
                                    },
                                    "key": "response_folder",
                                    "type": "textfield",
                                    "input": true
                                }
                            ],
                            "tableView": false
                        }
                    ],
                    "tableView": false
                },
                {
                    "label": "Salva",
                    "showValidations": false,
                    "disableOnInvalid": true,
                    "tableView": false,
                    "key": "submit",
                    "type": "button",
                    "saveOnEnter": false,
                    "input": true
                }
            ],
            "input": true,
            "key": "",
            "tableView": false,
            "label": ""
        }
    ]
}
