{
    "display": "form",
    "components": [
        {
            "label": "Descrizione dell'ente",
            "placeholder": "Comune di Bugliano",
            "defaultValue": " ",
            "clearOnHide": false,
            "validate": {
                "required": true
            },
            "key": "description",
            "type": "textfield",
            "input": true,
            "hidden": true,
            "tableView": true
        },
        {
            "label": "UUID dell'ente",
            "placeholder": "XXXXXXXX-XXXX-XXXX-XXXX-XXXXXXXXXXXX",
            "hidden": true,
            "tableView": true,
            "clearOnHide": false,
            "validate": {
                "required": true
            },
            "key": "tenant_sdc_id",
            "type": "textfield",
            "input": true
        },
        {
            "label": "UUID del Servizio",
            "placeholder": "XXXXXXXX-XXXX-XXXX-XXXX-XXXXXXXXXXXX",
            "clearOnHide": false,
            "validate": {
                "required": true
            },
            "key": "sdc_id",
            "type": "textfield",
            "input": true,
            "hidden": true,
            "tableView": true
        },
        {
            "label": "Stati delle pratiche da protocollare",
            "widget": "choicesjs",
            "multiple": true,
            "data": {
                "values": [
                    {
                        "label": "Acquisita",
                        "value": "status_submitted"
                    },
                    {
                        "label": "Richiesta di integrazione",
                        "value": "status_request_integration"
                    },
                    {
                        "label": "Risposta integrazione",
                        "value": "status_submitted_after_integration"
                    },
                    {
                        "label": "Accettata",
                        "value": "status_complete"
                    },
                    {
                        "label": "Rifiutata",
                        "value": "status_cancelled"
                    },
                    {
                        "label": "Ritirata",
                        "value": "status_withdraw"
                    }
                ]
            },
            "key": "application_states",
            "type": "select",
            "input": true,
            "hidden": true,
            "tableView": true
        },
        {
            "label": "Configurazione",
            "disableAddingRemovingRows": true,
            "reorder": false,
            "addAnotherPosition": "bottom",
            "layoutFixed": false,
            "enableRowGroups": false,
            "initEmpty": false,
            "hideLabel": true,
            "defaultValue": [
                {
                  "description": "",
                  "is_active": false,
                  "username": "",
                  "password": "",
                  "registry_url": "",
                  "office_ids": [],
                  "classification": "",
                  "folder_number": "",
                  "folder_year": "",
                  "annotation": ""
              }
            ],
            "validate": {
                "required": true,
                "minLength": "1",
                "maxLength": "1"
            },
            "errorLabel": "Devi fornire almeno una configurazione",
            "key": "configs",
            "type": "datagrid",
            "input": true,
            "components": [
                {
                    "key": "fieldSet",
                    "type": "fieldset",
                    "label": "Configurazione",
                    "input": false,
                    "components": [
                        {
                            "label": "Descrizione del servizio",
                            "placeholder": "Comune di Bugliano",
                            "defaultValue": " ",
                            "clearOnHide": false,
                            "validate": {
                                "required": true
                            },
                            "key": "description",
                            "type": "textfield",
                            "input": true,
                            "hidden": true,
                            "tableView": true
                        },
                        {
                            "label": "Attivo",
                            "defaultValue": false,
                            "clearOnHide": false,
                            "key": "is_active",
                            "type": "checkbox",
                            "input": true,
                            "tableView": false
                        },
                        {
                            "label": "Username",
                            "description": "Viene fornito dall’ente per l’accesso al servizio di inserimento protocollo",
                            "tableView": true,
                            "validate": {
                                "required": true,
                                "maxLength": 64
                            },
                            "key": "username",
                            "type": "textfield",
                            "input": true
                        },
                        {
                            "label": "Password",
                            "placeholder": "***********",
                            "description": "Viene fornita dall’ente in fase di attivazione del collegamento",
                            "tableView": true,
                            "validate": {
                                "required": true,
                                "maxLength": 32
                            },
                            "key": "password",
                            "type": "textfield",
                            "input": true
                        },
                        {
                            "label": "URL Protocollo",
                            "placeholder": "http://example.com/",
                            "tableView": true,
                            "validate": {
                                "required": true
                            },
                            "key": "registry_url",
                            "type": "url",
                            "input": true
                        },
                        {
                            "label": "Identificativi degli uffici mittenti/destinatari",
                            "placeholder": "101",
                            "description": "L'elenco degli uffici in uso presso l'ente verranno forniti dal gestore del protocollo. Se questo parametro non viene fornito verrà utilizzato l'ufficio impostato di default",
                            "applyMaskOn": "change",
                            "mask": false,
                            "tableView": false,
                            "multiple": true,
                            "delimiter": false,
                            "requireDecimal": false,
                            "inputFormat": "plain",
                            "truncateMultipleSpaces": false,
                            "validate": {
                                "required": true
                            },
                            "key": "office_ids",
                            "type": "number",
                            "input": true
                        },
                        {
                            "label": "Classificazione",
                            "placeholder": "6-3-0",
                            "description": "L'elenco delle classificazioni in uso presso l'ente verranno forniti dal gestore del protocollo. Se questo parametro non viene fornito verrà utilizzata la classificazione impostata di default. NB: i numeri vanno obbligatoriamente separati da trattino.",
                            "applyMaskOn": "change",
                            "tableView": true,
                            "validate": {
                                "maxLength": 16
                            },
                            "key": "classification",
                            "type": "textfield",
                            "input": true
                        },
                        {
                            "label": "Numero del Fascicolo",
                            "placeholder": "1",
                            "description": "L'elenco dei fascicoli in uso presso l'ente verranno forniti dal gestore del protocollo. Se questo parametro non viene fornito verrà utilizzato i fascicolo impostato di default",
                            "applyMaskOn": "change",
                            "tableView": true,
                            "validate": {
                                "maxLength": 16
                            },
                            "key": "folder_number",
                            "type": "textfield",
                            "input": true
                        },
                        {
                            "label": "Anno del Fascicolo",
                            "placeholder": "2021",
                            "description": "L'elenco dei fascicoli in uso presso l'ente verranno forniti dal gestore del protocollo. Se questo parametro non viene fornito verrà utilizzato i fascicolo impostato di default",
                            "applyMaskOn": "change",
                            "tableView": true,
                            "validate": {
                                "maxLength": 16
                            },
                            "key": "folder_year",
                            "type": "textfield",
                            "input": true
                        },
                        {
                            "label": "Annotazione",
                            "placeholder": "Note protocollo generale",
                            "description": "Annotazione relativa al protocollo",
                            "applyMaskOn": "change",
                            "tableView": true,
                            "validate": {
                                "maxLength": 128
                            },
                            "key": "annotation",
                            "type": "textfield",
                            "input": true
                        }
                    ],
                    "tableView": false
                }
            ],
            "tableView": false
        },
        {
            "label": "Salva",
            "showValidations": false,
            "disableOnInvalid": true,
            "tableView": false,
            "key": "submit",
            "type": "button",
            "saveOnEnter": false,
            "input": true
        }
    ]
}
