{
  "extends": [
    "config:base",
    ":labels(renovate)"
  ],
  "repositories": [
    "opencontent/stanza-del-cittadino/external-page-payment-proxy"
  ],
  "recreateClosed": false,
  "major": {
    "enabled": false
  }
}
