{
  "id": "daa0f528-b582-4d1c-9691-e226ac443424",
  "tenant_id": "60e35f02-1509-408c-b101-3b1a28109329",
  "active": true,
  "code": "pag_gen",
  "entry_code": "9/1234",
  "description": "descrizione test",
  "acc_entry": "3445",
  "acc_cap": "34",
  "acc_art": "3",
  "splitted": true,
  "split": [
    {
      "split_code": "c_1",
      "split_amount": 16.0,
      "split_description": "Diritti di Segreteria",
      "split_acc_entry": "3445",
      "split_acc_cap": "34",
      "split_acc_art": "3"
    },
    {
      "split_code": "c_2",
      "split_amount": 0.5,
      "split_description": "Diritti della CIE",
      "split_acc_entry": "3445",
      "split_acc_cap": "34",
      "split_acc_art": "3"
    }
  ]
}
