{
    "title": "Risposta integrazione: Protocollazione esterna [FAKE REGISTRY PROXY] Michelangelo Buonarroti BNRMHL75C06G702B - 1a30529e-9c41-4352-9198-1fac44c5e911",
    "id": "a83ead00-2a62-404c-a416-b965a400bcd6",
    "app_id": "protocol-proxy-sicraweb-evo",
    "event_created_at": "2023-12-21T16:58:49+00:00",
    "event_id": "367fd4d2-4c8a-4124-a853-70c67bea0b03",
    "event_version": 1,
    "registration_data": {
        "transmission_type": "Inbound",
        "date": "",
        "document_number": ""
    },
    "folder": {
        "title": "Protocollazione esterna [FAKE REGISTRY PROXY]-Michelangelo Buonarroti BNRMHL75C06G702B",
        "id": ""
    },
    "status": "DOCUMENT_CREATED",
    "type": "integration-response",
    "remote_id": "1a30529e-9c41-4352-9198-1fac44c5e911",
    "remote_collection": {
        "id": "bdefd713-feb9-4bbe-9308-1afe4dcbd858",
        "type": "service"
    },
    "topics": null,
    "short_description": "Protocollazione esterna [FAKE REGISTRY PROXY] Michelangelo Buonarroti BNRMHL75C06G702B - 1a30529e-9c41-4352-9198-1fac44c5e911",
    "description": "Protocollazione esterna [FAKE REGISTRY PROXY] Michelangelo Buonarroti BNRMHL75C06G702B - 1a30529e-9c41-4352-9198-1fac44c5e911",
    "main_document": {
        "name": "risposta-a-richiesta-integrazione-cccda494-9d02-4a92-9e05-cbad01096818-202311230314.pdf",
        "description": "Risposta a richiesta integrazione: cccda494-9d02-4a92-9e05-cbad01096818 2023-11-23 03:14",
        "mime_type": "application/pdf",
        "url": "https://servizi.comune-qa.bugliano.pi.it/lang/api/applications/1a30529e-9c41-4352-9198-1fac44c5e911/attachments/241879ee-a133-4456-8473-811781daeb67?version=1",
        "md5": "",
        "filename": "655f5e343daa3.pdf"
    },
    "image_gallery": null,
    "attachments": [
        {
            "name": "dummy.pdf",
            "description": "Allegato - dummy.pdf",
            "mime_type": "application/pdf",
            "url": "https://servizi.comune-qa.bugliano.pi.it/lang/api/applications/1a30529e-9c41-4352-9198-1fac44c5e911/attachments/a4c81464-ee91-449a-b2a3-7010c59fdee7?version=1",
            "md5": "",
            "filename": "dummy.pdf"
        },
        {
            "name": "dummy2.pdf",
            "description": "Allegato - dummy2.pdf",
            "mime_type": "application/pdf",
            "url": "https://servizi.comune-qa.bugliano.pi.it/lang/api/applications/1a30529e-9c41-4352-9198-1fac44c5e911/attachments/d284be8a-2700-48a9-aa4b-fc0136674548?version=1",
            "md5": "",
            "filename": "dummy2.pdf"
        }
    ],
    "related_public_services": null,
    "normative_requirements": null,
    "related_documents": null,
    "life_events": null,
    "business_events": null,
    "allowed_readers": null,
    "tenant_id": "60e35f02-1509-408c-b101-3b1a28109329",
    "owner_id": "5b00796e-ef10-4c98-b9f5-b0f7ffd7a17d",
    "created_at": "2023-11-23T14:14:23+00:00",
    "updated_at": "",
    "author": [
        {
            "type": "human",
            "tax_identification_number": "BNRMHL75C06G702B",
            "name": "Michelangelo",
            "family_name": "Buonarroti",
            "street_name": "Via Antica Aia",
            "postal_code": "67049",
            "email": "nevis.menegatti@opencontent.it",
            "role": "sender"
        }
    ],
    "source_type": "user",
    "recipient_type": "tenant"
}