{
    "id": "configuration",
    "is_active": true,
    "username": "user@user",
    "idaoo_code": "x",
    "password": "xxx",
    "office_code": [
        "xxx",
        "yyy"
    ],
    "id_fascicolo": "x",
    "document_type": "x",
    "api_url": "http://test.it",
    "tenant_id": "test-tenant"
}