{
    "display": "form",
    "components": [
        {
            "label": "UUID dell'ente",
            "placeholder": "XXXXXXXX-XXXX-XXXX-XXXX-XXXXXXXXXXXX",
            "applyMaskOn": "change",
            "hidden": true,
            "tableView": true,
            "validate": {
                "required": true
            },
            "key": "tenant_id",
            "type": "textfield",
            "input": true
        },
        {
            "label": "UUID del Servizio",
            "placeholder": "XXXXXXXX-XXXX-XXXX-XXXX-XXXXXXXXXXXX",
            "applyMaskOn": "change",
            "hidden": true,
            "tableView": true,
            "validate": {
                "required": true
            },
            "key": "id",
            "type": "textfield",
            "input": true
        },
        {
            "label": "Abilitato",
            "hidden": true,
            "tableView": false,
            "defaultValue": true,
            "clearOnHide": false,
            "validate": {
                "required": true
            },
            "key": "is_active",
            "type": "checkbox",
            "input": true
        },
        {
            "label": "WS Url",
            "placeholder": "https://protocollo.example.com",
            "applyMaskOn": "change",
            "tableView": true,
            "key": "ws_url",
            "type": "textfield",
            "input": true,
            "validate": {
                "required": true
            }
        },
        {
            "label": "token Url",
            "placeholder": "https://protocollo.example.com",
            "applyMaskOn": "change",
            "tableView": true,
            "key": "token_url",
            "type": "textfield",
            "input": true,
            "validate": {
                "required": true
            }
        },
        {
            "label": "Username",
            "placeholder": "es.admin",
            "applyMaskOn": "change",
            "tableView": true,
            "key": "username",
            "type": "textfield",
            "input": true,
            "validate": {
                "required": true
            }
        },
        {
            "label": "Password",
            "applyMaskOn": "change",
            "tableView": false,
            "key": "password",
            "type": "password",
            "input": true,
            "protected": true,
            "validate": {
                "required": true
            }
        },
        {
            "label": "Consumer Key",
            "applyMaskOn": "change",
            "tableView": false,
            "key": "consumer_key",
            "type": "password",
            "input": true,
            "protected": true,
            "validate": {
                "required": true
            }
        },
        {
            "label": "Consumer Secret",
            "applyMaskOn": "change",
            "tableView": false,
            "key": "consumer_secret",
            "type": "password",
            "input": true,
            "protected": true,
            "validate": {
                "required": true
            }
        },
        {
            "label": "Codice Ente",
            "applyMaskOn": "change",
            "tableView": true,
            "key": "codente",
            "type": "textfield",
            "input": true,
            "validate": {
                "required": true
            }
        },
        {
            "label": "Codice Amministrazione",
            "applyMaskOn": "change",
            "tableView": true,
            "key": "codice_amministrazione",
            "type": "textfield",
            "input": true,
            "validate": {
                "required": true
            }
        },
        {
            "label": "Email",
            "applyMaskOn": "change",
            "tableView": true,
            "validate": {
                "required": true
            },
            "key": "email",
            "type": "email",
            "input": true
        },
        {
            "label": "Codice Classificazione",
            "applyMaskOn": "change",
            "tableView": true,
            "key": "class_cod",
            "type": "textfield",
            "input": true,
            "validate": {
                "required": true
            }
        },
        {
            "label": "Denominazione Ufficio",
            "applyMaskOn": "change",
            "tableView": true,
            "key": "denominazione",
            "type": "textfield",
            "input": true,
            "validate": {
                "required": true
            }
        },
        {
            "label": "ID unità organizzativa",
            "applyMaskOn": "change",
            "tableView": true,
            "key": "id_unit_org",
            "type": "textfield",
            "input": true,
            "validate": {
                "required": true
            }
        },
        {
            "label": "Codice AOO",
            "applyMaskOn": "change",
            "tableView": true,
            "key": "codice_aoo",
            "type": "textfield",
            "input": true,
            "validate": {
                "required": true
            }
        },
        {
            "label": "Anno Fascicolo",
            "applyMaskOn": "change",
            "tableView": true,
            "key": "folder_year",
            "type": "textfield",
            "input": true
        },
        {
            "label": "Numero Fascicolo",
            "applyMaskOn": "change",
            "tableView": true,
            "key": "folder_number",
            "type": "textfield",
            "input": true
        },
        {
            "label": "Tipo Documento",
            "applyMaskOn": "change",
            "tableView": true,
            "key": "tipo_documento",
            "type": "textfield",
            "input": true
        },
        {
            "label": "Tipo Smistamento",
            "applyMaskOn": "change",
            "tableView": true,
            "key": "dispatch_type",
            "type": "select",
            "defaultValue": "CONOSCENZA",
            "input": true,
            "data": {
                "values": [
                    {
                        "label": "Conoscenza",
                        "value": "CONOSCENZA"
                    },
                    {
                        "label": "Competenza",
                        "value": "COMPETENZA"
                    }
                ]
            }
        },
        {
            "label": "Smistamento secondario",
            "key": "dispatch_list",
            "type": "datagrid",
            "initEmpty": true,
            "input": true,
            "components": [
                {
                    "label": "Codice unità",
                    "placeholder": "Inserisci ID",
                    "key": "code_unit",
                    "type": "textfield",
                    "input": true,
                    "validate": {
                        "required": false
                    }
                },
                {
                    "label": "Tipo smistamento",
                    "key": "dispatch_type",
                    "type": "select",
                    "input": true,
                    "data": {
                        "values": [
                            {
                                "label": "Conoscenza",
                                "value": "CONOSCENZA"
                            },
                            {
                                "label": "Competenza",
                                "value": "COMPETENZA"
                            }
                        ]
                    },
                    "validate": {
                        "required": false
                    }
                }
            ],
            "description": "Inserisci per gli smistamenti secondari al protocollo il Codice unità e seleziona il tipo di smitamento(Conoscenza o Competenza)."
        },
        {
            "type": "button",
            "label": "Salva",
            "key": "submit",
            "disableOnInvalid": true,
            "input": true,
            "tableView": false
        }
    ]
}