{
    "id": "bdefd713-feb9-4bbe-0000-1afe4dcbd858",
    "is_active": true,
    "login_url": "https://example.com/",
    "registry_url": "https://example.com/",
    "client_user": "XXX",
    "client_secret": "XXX",
    "grant_type": "client_credentials",
    "user_code": "XXX",
    "operating_office_code": null,
    "office_code": "XXX",
    "office_registry": "XXX",
    "internal_offices": [
        {
            "code": "XXX",
            "type": "XXX"
        }
    ],
    "register_code": "XXX",
    "anno": null,
    "numero": null,
    "prog_doc": null,
    "prog_movi": null,
    "tenant_id": "60e35f02-1509-408c-0000-3b1a28109329"
}