{
    "data": [
      {
        "id": "a6fcd036-f1a2-4df5-b986-7410e9e0e97a",
        "version": "5",
        "name": "C020 Accertamento Residenza",
        "aud_client_assertion": "auth.uat.interop.pagopa.it/client-assertion",
        "audience": "https://modipa-val.anpr.interno.it/govway/rest/in/MinInternoPortaANPR/C020-servizioAccertamentoResidenza/v1",
        "endpoint":"https://modipa-val.anpr.interno.it/govway/rest/in/MinInternoPortaANPR-PDND/C020-servizioAccertamentoResidenza/v1/anpr-service-e002"
      },
      {
        "id": "1",
        "version": "5",
        "name": "C021 stato famiglia",
        "aud_client_assertion": "auth.uat.interop.pagopa.it/client-assertion",
        "audience": "https://modipa-val.anpr.interno.it/govway/rest/in/MinInternoPortaANPR/C020-servizioAccertamentoResidenza/v1",
        "endpoint":"https://modipa-val.anpr.interno.it/govway/rest/in/MinInternoPortaANPR-PDND/C020-servizioAccertamentoResidenza/v1/anpr-service-e002"
      },
      {
        "id": "2",
        "version": "5",
        "name": "C023 test servizio",
        "aud_client_assertion": "auth.uat.interop.pagopa.it/client-assertion",
        "audience": "https://modipa-val.anpr.interno.it/govway/rest/in/MinInternoPortaANPR/C020-servizioAccertamentoResidenza/v1",
        "endpoint":"https://modipa-val.anpr.interno.it/govway/rest/in/MinInternoPortaANPR-PDND/C020-servizioAccertamentoResidenza/v1/anpr-service-e002"
      }
    ]
  }