{
  "id": "3fa85f64-5717-4562-b3fc-2c963f66afa6",
  "active": true,
  "endpoint": "http://civilianext.soluzionipa.it",
  "production": false,
  "code": "c_b240",
  "name": "Comune di Empoli",
  "tax_number": "03482920158",
  "payments_endpoint": "https://pagopa-staging.maggioli.cloud/jcitygov-pagopa/api/rest",
  "payments_username": "service-opencity-empoli",
  "payments_password": "@F25|Dmv7:e(R3zy",
  "printer_endpoint": "https://pagopa-staging.maggioli.cloud/jppaPrinterApi/rest/printer/v2",
  "printer_username": "service-opencity-empoli",
  "printer_password": "PrntColl@vg7r0kntg9xv",
  "printer_code": "JPPAColl"
}
