{
  "display": "form",
  "type": "form",
  "components": [
    {
      "label": "Columns",
      "columns": [
        {
          "components": [
            {
              "label": "Nome",
              "tableView": true,
              "validate": {
                "required": true,
                "custom": "",
                "customPrivate": false,
                "strictDateValidation": false,
                "multiple": false,
                "unique": false,
                "minLength": "",
                "maxLength": "",
                "pattern": ""
              },
              "key": "child_name",
              "type": "textfield",
              "input": true,
              "hideOnChildrenHidden": false,
              "placeholder": "",
              "prefix": "",
              "customClass": "",
              "suffix": "",
              "multiple": false,
              "defaultValue": null,
              "protected": false,
              "unique": false,
              "persistent": true,
              "hidden": false,
              "clearOnHide": true,
              "refreshOn": "",
              "redrawOn": "",
              "modalEdit": false,
              "dataGridLabel": false,
              "labelPosition": "top",
              "description": "",
              "errorLabel": "",
              "tooltip": "",
              "hideLabel": false,
              "tabindex": "",
              "disabled": false,
              "autofocus": false,
              "dbIndex": false,
              "customDefaultValue": "",
              "calculateValue": "",
              "calculateServer": false,
              "widget": {
                "type": "input"
              },
              "validateOn": "change",
              "conditional": {
                "show": null,
                "when": null,
                "eq": ""
              },
              "overlay": {
                "style": "",
                "left": "",
                "top": "",
                "width": "",
                "height": ""
              },
              "allowCalculateOverride": false,
              "encrypted": false,
              "showCharCount": false,
              "showWordCount": false,
              "allowMultipleMasks": false,
              "addons": [],
              "mask": false,
              "inputType": "text",
              "inputFormat": "plain",
              "inputMask": "",
              "displayMask": "",
              "spellcheck": true,
              "truncateMultipleSpaces": false,
              "id": "e6xmk4"
            }
          ],
          "width": 6,
          "offset": 0,
          "push": 0,
          "pull": 0,
          "size": "md",
          "currentWidth": 6
        },
        {
          "components": [
            {
              "label": "Cognome",
              "tableView": true,
              "validate": {
                "required": true,
                "custom": "",
                "customPrivate": false,
                "strictDateValidation": false,
                "multiple": false,
                "unique": false,
                "minLength": "",
                "maxLength": "",
                "pattern": ""
              },
              "key": "child_surname",
              "type": "textfield",
              "input": true,
              "hideOnChildrenHidden": false,
              "placeholder": "",
              "prefix": "",
              "customClass": "",
              "suffix": "",
              "multiple": false,
              "defaultValue": null,
              "protected": false,
              "unique": false,
              "persistent": true,
              "hidden": false,
              "clearOnHide": true,
              "refreshOn": "",
              "redrawOn": "",
              "modalEdit": false,
              "dataGridLabel": false,
              "labelPosition": "top",
              "description": "",
              "errorLabel": "",
              "tooltip": "",
              "hideLabel": false,
              "tabindex": "",
              "disabled": false,
              "autofocus": false,
              "dbIndex": false,
              "customDefaultValue": "",
              "calculateValue": "",
              "calculateServer": false,
              "widget": {
                "type": "input"
              },
              "validateOn": "change",
              "conditional": {
                "show": null,
                "when": null,
                "eq": ""
              },
              "overlay": {
                "style": "",
                "left": "",
                "top": "",
                "width": "",
                "height": ""
              },
              "allowCalculateOverride": false,
              "encrypted": false,
              "showCharCount": false,
              "showWordCount": false,
              "allowMultipleMasks": false,
              "addons": [],
              "mask": false,
              "inputType": "text",
              "inputFormat": "plain",
              "inputMask": "",
              "displayMask": "",
              "spellcheck": true,
              "truncateMultipleSpaces": false,
              "id": "eatvz8n"
            }
          ],
          "size": "md",
          "width": 6,
          "offset": 0,
          "push": 0,
          "pull": 0,
          "currentWidth": 6
        },
        {
          "components": [
            {
              "label": "Luogo di nascita",
              "tableView": true,
              "validate": {
                "required": true,
                "custom": "",
                "customPrivate": false,
                "strictDateValidation": false,
                "multiple": false,
                "unique": false,
                "minLength": "",
                "maxLength": "",
                "pattern": ""
              },
              "key": "child_place_of_birth",
              "type": "textfield",
              "input": true,
              "hideOnChildrenHidden": false,
              "placeholder": "",
              "prefix": "",
              "customClass": "",
              "suffix": "",
              "multiple": false,
              "defaultValue": null,
              "protected": false,
              "unique": false,
              "persistent": true,
              "hidden": false,
              "clearOnHide": true,
              "refreshOn": "",
              "redrawOn": "",
              "modalEdit": false,
              "dataGridLabel": false,
              "labelPosition": "top",
              "description": "",
              "errorLabel": "",
              "tooltip": "",
              "hideLabel": false,
              "tabindex": "",
              "disabled": false,
              "autofocus": false,
              "dbIndex": false,
              "customDefaultValue": "",
              "calculateValue": "",
              "calculateServer": false,
              "widget": {
                "type": "input"
              },
              "validateOn": "change",
              "conditional": {
                "show": null,
                "when": null,
                "eq": ""
              },
              "overlay": {
                "style": "",
                "left": "",
                "top": "",
                "width": "",
                "height": ""
              },
              "allowCalculateOverride": false,
              "encrypted": false,
              "showCharCount": false,
              "showWordCount": false,
              "allowMultipleMasks": false,
              "addons": [],
              "mask": false,
              "inputType": "text",
              "inputFormat": "plain",
              "inputMask": "",
              "displayMask": "",
              "spellcheck": true,
              "truncateMultipleSpaces": false,
              "id": "ebcjysu"
            }
          ],
          "size": "md",
          "width": 6,
          "offset": 0,
          "push": 0,
          "pull": 0,
          "currentWidth": 6
        },
        {
          "components": [
            {
              "label": "Data di nascita",
              "labelPosition": "top",
              "placeholder": "",
              "description": "",
              "tooltip": "",
              "prefix": "",
              "suffix": "",
              "widget": {
                "type": "input"
              },
              "inputMask": "99/99/9999",
              "displayMask": "",
              "applyMaskOn": "change",
              "allowMultipleMasks": false,
              "customClass": "",
              "tabindex": "",
              "autocomplete": "",
              "hidden": false,
              "hideLabel": false,
              "showWordCount": false,
              "showCharCount": false,
              "mask": false,
              "autofocus": false,
              "spellcheck": true,
              "disabled": false,
              "tableView": true,
              "modalEdit": false,
              "multiple": false,
              "persistent": true,
              "inputFormat": "plain",
              "protected": false,
              "dbIndex": false,
              "case": "",
              "truncateMultipleSpaces": false,
              "encrypted": false,
              "redrawOn": "",
              "clearOnHide": true,
              "customDefaultValue": "",
              "calculateValue": "",
              "calculateServer": false,
              "allowCalculateOverride": false,
              "validateOn": "change",
              "validate": {
                "required": true,
                "pattern": "",
                "customMessage": "",
                "custom": "date = moment(input, 'DD/MM/YYYY')\npossible_birth = moment().add(9, \"months\")\nvalid = (date.isBefore(possible_birth) && date.isValid()) ? true : \"La data non è valida\"",
                "customPrivate": false,
                "json": "",
                "minLength": "",
                "maxLength": "",
                "strictDateValidation": false,
                "multiple": false,
                "unique": false
              },
              "unique": false,
              "errorLabel": "",
              "errors": "",
              "key": "child_date_of_birth",
              "tags": [],
              "conditional": {
                "show": null,
                "when": null,
                "eq": "",
                "json": ""
              },
              "customConditional": "",
              "logic": [],
              "overlay": {
                "style": "",
                "page": "",
                "left": "",
                "top": "",
                "width": "",
                "height": ""
              },
              "type": "textfield",
              "input": true,
              "hideOnChildrenHidden": false,
              "refreshOn": "",
              "dataGridLabel": false,
              "addons": [],
              "inputType": "text",
              "id": "eb0upna",
              "inputMaskPlaceholderChar": "",
              "defaultValue": ""
            }
          ],
          "width": 6,
          "offset": 0,
          "push": 0,
          "pull": 0,
          "size": "md",
          "currentWidth": 6
        },
        {
          "components": [
            {
              "label": "Genere",
              "optionsLabelPosition": "right",
              "inline": false,
              "tableView": false,
              "values": [
                {
                  "label": "Maschio",
                  "value": "maschio",
                  "shortcut": ""
                },
                {
                  "label": "Femmina",
                  "value": "femmina",
                  "shortcut": ""
                }
              ],
              "validate": {
                "required": true,
                "custom": "",
                "customPrivate": false,
                "strictDateValidation": false,
                "multiple": false,
                "unique": false,
                "onlyAvailableItems": false
              },
              "key": "child_gender",
              "type": "radio",
              "input": true,
              "hideOnChildrenHidden": false,
              "placeholder": "",
              "prefix": "",
              "customClass": "",
              "suffix": "",
              "multiple": false,
              "defaultValue": null,
              "protected": false,
              "unique": false,
              "persistent": true,
              "hidden": false,
              "clearOnHide": true,
              "refreshOn": "",
              "redrawOn": "",
              "modalEdit": false,
              "dataGridLabel": false,
              "labelPosition": "top",
              "description": "",
              "errorLabel": "",
              "tooltip": "",
              "hideLabel": false,
              "tabindex": "",
              "disabled": false,
              "autofocus": false,
              "dbIndex": false,
              "customDefaultValue": "",
              "calculateValue": "",
              "calculateServer": false,
              "widget": null,
              "validateOn": "change",
              "conditional": {
                "show": null,
                "when": null,
                "eq": ""
              },
              "overlay": {
                "style": "",
                "left": "",
                "top": "",
                "width": "",
                "height": ""
              },
              "allowCalculateOverride": false,
              "encrypted": false,
              "showCharCount": false,
              "showWordCount": false,
              "allowMultipleMasks": false,
              "addons": [],
              "dataSrc": "values",
              "authenticate": false,
              "ignoreCache": false,
              "template": "<span>{{ item.label }}</span>",
              "inputType": "radio",
              "data": {
                "url": ""
              },
              "fieldSet": false,
              "id": "e8qbedm"
            },
            {
              "label": "Codice fiscale",
              "inputMask": "AAAAAA99A99A***A",
              "tableView": true,
              "case": "uppercase",
              "validate": {
                "required": true,
                "custom": "",
                "customPrivate": false,
                "strictDateValidation": false,
                "multiple": false,
                "unique": false,
                "minLength": "",
                "maxLength": "",
                "pattern": ""
              },
              "key": "child_fiscalcode",
              "type": "textfield",
              "input": true,
              "hideOnChildrenHidden": false,
              "placeholder": "",
              "prefix": "",
              "customClass": "",
              "suffix": "",
              "multiple": false,
              "defaultValue": null,
              "protected": false,
              "unique": false,
              "persistent": true,
              "hidden": false,
              "clearOnHide": true,
              "refreshOn": "",
              "redrawOn": "",
              "modalEdit": false,
              "dataGridLabel": false,
              "labelPosition": "top",
              "description": "",
              "errorLabel": "",
              "tooltip": "",
              "hideLabel": false,
              "tabindex": "",
              "disabled": false,
              "autofocus": false,
              "dbIndex": false,
              "customDefaultValue": "",
              "calculateValue": "",
              "calculateServer": false,
              "widget": {
                "type": "input"
              },
              "validateOn": "change",
              "conditional": {
                "show": null,
                "when": null,
                "eq": ""
              },
              "overlay": {
                "style": "",
                "left": "",
                "top": "",
                "width": "",
                "height": ""
              },
              "allowCalculateOverride": false,
              "encrypted": false,
              "showCharCount": false,
              "showWordCount": false,
              "allowMultipleMasks": false,
              "addons": [],
              "mask": false,
              "inputType": "text",
              "inputFormat": "plain",
              "displayMask": "",
              "spellcheck": true,
              "truncateMultipleSpaces": false,
              "id": "eq1lpfr"
            }
          ],
          "size": "md",
          "width": 12,
          "offset": 0,
          "push": 0,
          "pull": 0,
          "currentWidth": 12
        }
      ],
      "hideLabel": true,
      "key": "columns",
      "type": "columns",
      "input": false,
      "tableView": false,
      "id": "eqinsrs",
      "placeholder": "",
      "prefix": "",
      "customClass": "",
      "suffix": "",
      "multiple": false,
      "defaultValue": null,
      "protected": false,
      "unique": false,
      "persistent": false,
      "hidden": false,
      "clearOnHide": false,
      "refreshOn": "",
      "redrawOn": "",
      "modalEdit": false,
      "dataGridLabel": false,
      "labelPosition": "top",
      "description": "",
      "errorLabel": "",
      "tooltip": "",
      "tabindex": "",
      "disabled": false,
      "autofocus": false,
      "dbIndex": false,
      "customDefaultValue": "",
      "calculateValue": "",
      "calculateServer": false,
      "widget": null,
      "validateOn": "change",
      "validate": {
        "required": false,
        "custom": "",
        "customPrivate": false,
        "strictDateValidation": false,
        "multiple": false,
        "unique": false
      },
      "conditional": {
        "show": null,
        "when": null,
        "eq": ""
      },
      "overlay": {
        "style": "",
        "left": "",
        "top": "",
        "width": "",
        "height": ""
      },
      "allowCalculateOverride": false,
      "encrypted": false,
      "showCharCount": false,
      "showWordCount": false,
      "allowMultipleMasks": false,
      "addons": [],
      "tree": false,
      "lazyLoad": false,
      "autoAdjust": false
    },
    {
      "type": "button",
      "label": "Submit",
      "key": "submit",
      "size": "md",
      "block": false,
      "action": "submit",
      "disableOnInvalid": true,
      "theme": "primary",
      "input": true,
      "placeholder": "",
      "prefix": "",
      "customClass": "",
      "suffix": "",
      "multiple": false,
      "defaultValue": null,
      "protected": false,
      "unique": false,
      "persistent": false,
      "hidden": false,
      "clearOnHide": true,
      "refreshOn": "",
      "redrawOn": "",
      "tableView": false,
      "modalEdit": false,
      "dataGridLabel": true,
      "labelPosition": "top",
      "description": "",
      "errorLabel": "",
      "tooltip": "",
      "hideLabel": false,
      "tabindex": "",
      "disabled": false,
      "autofocus": false,
      "dbIndex": false,
      "customDefaultValue": "",
      "calculateValue": "",
      "calculateServer": false,
      "widget": {
        "type": "input"
      },
      "validateOn": "change",
      "validate": {
        "required": false,
        "custom": "",
        "customPrivate": false,
        "strictDateValidation": false,
        "multiple": false,
        "unique": false
      },
      "conditional": {
        "show": null,
        "when": null,
        "eq": ""
      },
      "overlay": {
        "style": "",
        "left": "",
        "top": "",
        "width": "",
        "height": ""
      },
      "allowCalculateOverride": false,
      "encrypted": false,
      "showCharCount": false,
      "showWordCount": false,
      "allowMultipleMasks": false,
      "addons": [],
      "leftIcon": "",
      "rightIcon": "",
      "id": "etuyyr8"
    }
  ],
  "tags": [
    "component"
  ],
  "_id": "627cbd1e56f4af00183f084f",
  "title": "Anagrafica figli",
  "name": "Anagrafica figli",
  "description": "Figlio",
  "path": "child",
  "modified": "2023-11-20T11:09:48.094Z",
  "created": "2022-05-12T07:54:06.233Z",
  "__v": 10
}
