{
  "display": "form",
  "type": "form",
  "components": [
    {
      "label": "HTML",
      "attrs": [
        {
          "attr": "",
          "value": ""
        }
      ],
      "content": "<h5>Dati anagrafici</h5>",
      "refreshOnChange": false,
      "key": "html8",
      "type": "htmlelement",
      "input": false,
      "tableView": false,
      "keyModified": true,
      "placeholder": "",
      "prefix": "",
      "customClass": "",
      "suffix": "",
      "multiple": false,
      "defaultValue": null,
      "protected": false,
      "unique": false,
      "persistent": false,
      "hidden": false,
      "clearOnHide": true,
      "refreshOn": "",
      "redrawOn": "",
      "modalEdit": false,
      "dataGridLabel": false,
      "labelPosition": "top",
      "description": "",
      "errorLabel": "",
      "tooltip": "",
      "hideLabel": false,
      "tabindex": "",
      "disabled": false,
      "autofocus": false,
      "dbIndex": false,
      "customDefaultValue": "",
      "calculateValue": "",
      "calculateServer": false,
      "widget": null,
      "validateOn": "change",
      "validate": {
        "required": false,
        "custom": "",
        "customPrivate": false,
        "strictDateValidation": false,
        "multiple": false,
        "unique": false
      },
      "conditional": {
        "show": null,
        "when": null,
        "eq": ""
      },
      "overlay": {
        "style": "",
        "left": "",
        "top": "",
        "width": "",
        "height": ""
      },
      "allowCalculateOverride": false,
      "encrypted": false,
      "showCharCount": false,
      "showWordCount": false,
      "allowMultipleMasks": false,
      "tag": "p",
      "id": "e6g2no",
      "addons": []
    },
    {
      "reference": false,
      "form": "5d4d26ff9410f50010f30068",
      "label": "Nome_Cognome",
      "input": true,
      "type": "form",
      "reorder": false,
      "tableView": true,
      "alwaysEnabled": false,
      "key": "completename",
      "mask": false,
      "placeholder": "",
      "prefix": "",
      "customClass": "",
      "suffix": "",
      "multiple": false,
      "defaultValue": null,
      "protected": false,
      "unique": false,
      "persistent": true,
      "hidden": false,
      "clearOnHide": true,
      "refreshOn": "",
      "redrawOn": "",
      "modalEdit": false,
      "dataGridLabel": false,
      "labelPosition": "top",
      "description": "",
      "errorLabel": "",
      "tooltip": "",
      "hideLabel": false,
      "tabindex": "",
      "disabled": false,
      "autofocus": false,
      "dbIndex": false,
      "customDefaultValue": "",
      "calculateValue": "",
      "calculateServer": false,
      "widget": null,
      "validateOn": "change",
      "validate": {
        "required": false,
        "custom": "",
        "customPrivate": false,
        "strictDateValidation": false,
        "multiple": false,
        "unique": false
      },
      "conditional": {
        "show": null,
        "when": null,
        "eq": ""
      },
      "overlay": {
        "style": "",
        "left": "",
        "top": "",
        "width": "",
        "height": ""
      },
      "allowCalculateOverride": false,
      "encrypted": false,
      "showCharCount": false,
      "showWordCount": false,
      "allowMultipleMasks": false,
      "addons": [],
      "src": "",
      "path": "",
      "id": "emoaj0a"
    },
    {
      "reference": false,
      "form": "5d5a41a4669977001b5b6177",
      "label": "Sesso",
      "input": true,
      "type": "form",
      "reorder": false,
      "tableView": true,
      "alwaysEnabled": false,
      "key": "gender",
      "mask": false,
      "placeholder": "",
      "prefix": "",
      "customClass": "",
      "suffix": "",
      "multiple": false,
      "defaultValue": null,
      "protected": false,
      "unique": false,
      "persistent": true,
      "hidden": false,
      "clearOnHide": true,
      "refreshOn": "",
      "redrawOn": "",
      "modalEdit": false,
      "dataGridLabel": false,
      "labelPosition": "top",
      "description": "",
      "errorLabel": "",
      "tooltip": "",
      "hideLabel": false,
      "tabindex": "",
      "disabled": false,
      "autofocus": false,
      "dbIndex": false,
      "customDefaultValue": "",
      "calculateValue": "",
      "calculateServer": false,
      "widget": null,
      "validateOn": "change",
      "validate": {
        "required": false,
        "custom": "",
        "customPrivate": false,
        "strictDateValidation": false,
        "multiple": false,
        "unique": false
      },
      "conditional": {
        "show": null,
        "when": null,
        "eq": ""
      },
      "overlay": {
        "style": "",
        "left": "",
        "top": "",
        "width": "",
        "height": ""
      },
      "allowCalculateOverride": false,
      "encrypted": false,
      "showCharCount": false,
      "showWordCount": false,
      "allowMultipleMasks": false,
      "addons": [],
      "src": "",
      "path": "",
      "id": "e8oia"
    },
    {
      "reference": false,
      "label": "CodiceFiscale",
      "input": true,
      "type": "form",
      "reorder": false,
      "calculateValue": "if(_.has(data, 'fiscal_code')){\n    let name = data.completename.data.name;\n    let surname = data.completename.data.surname;\n    let gender = data.gender.data.gender;\n    let date_of_birth = data.Born.data.natoAIl;\n    let fiscal_code = data.fiscal_code && data.fiscal_code.data.fiscal_code && data.fiscal_code.data.fiscal_code !== '' ? data.fiscal_code.data.fiscal_code.replace(/_/gi, \"\") : '';\n    \n    function loadJSON(path, payload, success, error) {\n        var xhr = new XMLHttpRequest();\n        xhr.open(\"POST\", path, true);\n        xhr.setRequestHeader(\"Content-Type\", \"application/json;charset=UTF-8\");\n    \n        xhr.onreadystatechange = function () {\n            if (xhr.readyState === XMLHttpRequest.DONE) {\n              var response = JSON.parse(xhr.response)\n              if (xhr.status === 200) {\n                document.getElementById('cf_alert').style.display = 'none';\n              } else {\n                document.getElementById('cf_alert').style.display = 'block';\n              }\n            }\n        };\n        \n        xhr.send(JSON.stringify(payload));\n    }\n    \n    if (name && surname && gender && date_of_birth && fiscal_code && fiscal_code.length === 16) {\n        let payload = {\n          \"name\": name,\n          \"surname\": surname,\n          \"gender\": gender,\n          \"date_of_birth\": date_of_birth,\n          \"fiscal_code\": fiscal_code.toUpperCase()\n        }\n    \n        loadJSON('https://fiscalcode.opencontent.it/validate', payload,\n            function () {\n            },\n            function () {\n            });\n    }\n}",
      "form": "5d7aa1b318fecd734051ae80",
      "alwaysEnabled": false,
      "key": "fiscal_code",
      "mask": false,
      "tableView": true,
      "placeholder": "",
      "prefix": "",
      "customClass": "",
      "suffix": "",
      "multiple": false,
      "defaultValue": null,
      "protected": false,
      "unique": false,
      "persistent": true,
      "hidden": false,
      "clearOnHide": true,
      "refreshOn": "",
      "redrawOn": "",
      "modalEdit": false,
      "dataGridLabel": false,
      "labelPosition": "top",
      "description": "",
      "errorLabel": "",
      "tooltip": "",
      "hideLabel": false,
      "tabindex": "",
      "disabled": false,
      "autofocus": false,
      "dbIndex": false,
      "customDefaultValue": "",
      "calculateServer": false,
      "widget": null,
      "validateOn": "change",
      "validate": {
        "required": false,
        "custom": "",
        "customPrivate": false,
        "strictDateValidation": false,
        "multiple": false,
        "unique": false
      },
      "conditional": {
        "show": null,
        "when": null,
        "eq": ""
      },
      "overlay": {
        "style": "",
        "left": "",
        "top": "",
        "width": "",
        "height": ""
      },
      "allowCalculateOverride": false,
      "encrypted": false,
      "showCharCount": false,
      "showWordCount": false,
      "allowMultipleMasks": false,
      "addons": [],
      "src": "",
      "path": "",
      "id": "e0sspr"
    },
    {
      "tag": "div",
      "attrs": [
        {
          "attr": "id",
          "value": "cf_alert"
        },
        {
          "attr": "style",
          "value": "display:none"
        }
      ],
      "label": "HTML",
      "content": "Il codice fiscale inserito non sembra valido, controllare con attenzione di averlo riportato correttamente.",
      "input": false,
      "type": "htmlelement",
      "tableView": false,
      "refreshOnChange": false,
      "key": "html",
      "className": "alert alert-danger",
      "placeholder": "",
      "prefix": "",
      "customClass": "",
      "suffix": "",
      "multiple": false,
      "defaultValue": null,
      "protected": false,
      "unique": false,
      "persistent": false,
      "hidden": false,
      "clearOnHide": true,
      "refreshOn": "",
      "redrawOn": "",
      "modalEdit": false,
      "dataGridLabel": false,
      "labelPosition": "top",
      "description": "",
      "errorLabel": "",
      "tooltip": "",
      "hideLabel": false,
      "tabindex": "",
      "disabled": false,
      "autofocus": false,
      "dbIndex": false,
      "customDefaultValue": "",
      "calculateValue": "",
      "calculateServer": false,
      "widget": null,
      "validateOn": "change",
      "validate": {
        "required": false,
        "custom": "",
        "customPrivate": false,
        "strictDateValidation": false,
        "multiple": false,
        "unique": false
      },
      "conditional": {
        "show": null,
        "when": null,
        "eq": ""
      },
      "overlay": {
        "style": "",
        "left": "",
        "top": "",
        "width": "",
        "height": ""
      },
      "allowCalculateOverride": false,
      "encrypted": false,
      "showCharCount": false,
      "showWordCount": false,
      "allowMultipleMasks": false,
      "addons": [],
      "id": "e1owrvr",
      "keyModified": true
    },
    {
      "reference": false,
      "form": "5d5a45a8669977001b5b6179",
      "label": "Form",
      "input": true,
      "type": "form",
      "reorder": false,
      "tableView": true,
      "alwaysEnabled": false,
      "key": "Born",
      "mask": false,
      "placeholder": "",
      "prefix": "",
      "customClass": "",
      "suffix": "",
      "multiple": false,
      "defaultValue": null,
      "protected": false,
      "unique": false,
      "persistent": true,
      "hidden": false,
      "clearOnHide": true,
      "refreshOn": "",
      "redrawOn": "",
      "modalEdit": false,
      "dataGridLabel": false,
      "labelPosition": "top",
      "description": "",
      "errorLabel": "",
      "tooltip": "",
      "hideLabel": false,
      "tabindex": "",
      "disabled": false,
      "autofocus": false,
      "dbIndex": false,
      "customDefaultValue": "",
      "calculateValue": "",
      "calculateServer": false,
      "widget": null,
      "validateOn": "change",
      "validate": {
        "required": false,
        "custom": "",
        "customPrivate": false,
        "strictDateValidation": false,
        "multiple": false,
        "unique": false
      },
      "conditional": {
        "show": null,
        "when": null,
        "eq": ""
      },
      "overlay": {
        "style": "",
        "left": "",
        "top": "",
        "width": "",
        "height": ""
      },
      "allowCalculateOverride": false,
      "encrypted": false,
      "showCharCount": false,
      "showWordCount": false,
      "allowMultipleMasks": false,
      "addons": [],
      "src": "",
      "path": "",
      "id": "eovesy",
      "keyModified": true
    },
    {
      "label": "API data",
      "customClass": "",
      "modalEdit": false,
      "defaultValue": null,
      "persistent": true,
      "protected": false,
      "dbIndex": false,
      "encrypted": false,
      "redrawOn": "",
      "customDefaultValue": "",
      "calculateValue": "async function fetchDataWithRetries(url, maxRetries) {\n  let retries = 0;\n\n  while (retries < maxRetries) {\n    try {\n      const response = await fetch(url);\n\n      if (!response.ok) {\n        throw new Error(`HTTP error! Status: ${response.status}`);\n      }\n\n      const dati = await response.json();\n      instance.setValue(dati[0])\n      return;\n    } catch (error) {\n      console.error(`Error fetching data: ${error.message}`);\n      retries++;\n      console.log(`Retrying... (Attempt ${retries} of ${maxRetries})`);\n    }\n  }\n  // Return a fixed string in case of failure\n  instance.setValue(\"C_ERROR\")\n}\n\n\nfunction slugify(str) {\n  return str\n    .toLowerCase()\n    .replace(/[^\\w\\s]/gi, '') // Rimuove caratteri non alfanumerici\n    .replace(/\\s+/g, '-')      // Sostituisce gli spazi con trattini\n    .trim();                   // Rimuove spazi iniziali e finali\n}\n\nif (data.Born.data.place_of_birth !== \"\") {\n  toAdd = slugify(data.Born.data.place_of_birth)\n  if (toAdd !== \"\" && value.comune !== toAdd) {\n    fetchDataWithRetries(\"https://api.opencontent.it/geo/comuni?slug=\" + toAdd, 3)\n  }\n}",
      "calculateServer": false,
      "key": "address_data_birth",
      "tags": [],
      "logic": [],
      "overlay": {
        "style": "",
        "page": "",
        "left": "",
        "top": "",
        "width": "",
        "height": ""
      },
      "type": "hidden",
      "input": true,
      "tableView": false,
      "placeholder": "",
      "prefix": "",
      "suffix": "",
      "multiple": false,
      "unique": false,
      "hidden": false,
      "clearOnHide": true,
      "refreshOn": "",
      "dataGridLabel": false,
      "labelPosition": "top",
      "description": "",
      "errorLabel": "",
      "tooltip": "",
      "hideLabel": false,
      "tabindex": "",
      "disabled": false,
      "autofocus": false,
      "widget": {
        "type": "input"
      },
      "validateOn": "change",
      "validate": {
        "required": false,
        "custom": "",
        "customPrivate": false,
        "strictDateValidation": false,
        "multiple": false,
        "unique": false
      },
      "conditional": {
        "show": null,
        "when": null,
        "eq": ""
      },
      "allowCalculateOverride": false,
      "showCharCount": false,
      "showWordCount": false,
      "allowMultipleMasks": false,
      "addons": [],
      "inputType": "hidden",
      "id": "eplup3r"
    },
    {
      "label": "Codice catastale",
      "persistent": false,
      "calculateValue": "if (data.address_data_birth !== \"\" && data.address_data_birth !== \"C_ERROR\") {\n  value = (data.address_data_birth?.cod_catastale) ? data.address_data_birth.cod_catastale : \"\"\n} else {\n  value = \"C_ERROR\"\n}",
      "key": "cadastral_code_birth",
      "type": "hidden",
      "input": true,
      "tableView": false,
      "id": "etive6r",
      "placeholder": "",
      "prefix": "",
      "customClass": "",
      "suffix": "",
      "multiple": false,
      "defaultValue": null,
      "protected": false,
      "unique": false,
      "hidden": false,
      "clearOnHide": true,
      "refreshOn": "",
      "redrawOn": "",
      "modalEdit": false,
      "dataGridLabel": false,
      "labelPosition": "top",
      "description": "",
      "errorLabel": "",
      "tooltip": "",
      "hideLabel": false,
      "tabindex": "",
      "disabled": false,
      "autofocus": false,
      "dbIndex": false,
      "customDefaultValue": "",
      "calculateServer": false,
      "widget": {
        "type": "input"
      },
      "validateOn": "change",
      "validate": {
        "required": false,
        "custom": "",
        "customPrivate": false,
        "strictDateValidation": false,
        "multiple": false,
        "unique": false
      },
      "conditional": {
        "show": null,
        "when": null,
        "eq": ""
      },
      "overlay": {
        "style": "",
        "left": "",
        "top": "",
        "width": "",
        "height": ""
      },
      "allowCalculateOverride": false,
      "encrypted": false,
      "showCharCount": false,
      "showWordCount": false,
      "allowMultipleMasks": false,
      "addons": [],
      "inputType": "hidden"
    },
    {
      "label": "HTML",
      "labelWidth": "",
      "labelMargin": "",
      "tag": "p",
      "className": "",
      "attrs": [
        {
          "attr": "",
          "value": ""
        }
      ],
      "content": "<h5>Residenza</h5>",
      "refreshOnChange": false,
      "customClass": "",
      "hidden": false,
      "modalEdit": false,
      "key": "html12",
      "tags": [],
      "conditional": {
        "show": null,
        "when": null,
        "eq": "",
        "json": ""
      },
      "customConditional": "",
      "logic": [],
      "overlay": {
        "style": "",
        "page": "",
        "left": "",
        "top": "",
        "width": "",
        "height": ""
      },
      "type": "htmlelement",
      "input": false,
      "tableView": false,
      "keyModified": true,
      "placeholder": "",
      "prefix": "",
      "suffix": "",
      "multiple": false,
      "defaultValue": null,
      "protected": false,
      "unique": false,
      "persistent": false,
      "clearOnHide": true,
      "refreshOn": "",
      "redrawOn": "",
      "dataGridLabel": false,
      "labelPosition": "top",
      "description": "",
      "errorLabel": "",
      "tooltip": "",
      "hideLabel": false,
      "tabindex": "",
      "disabled": false,
      "autofocus": false,
      "dbIndex": false,
      "customDefaultValue": "",
      "calculateValue": "",
      "calculateServer": false,
      "widget": null,
      "validateOn": "change",
      "validate": {
        "required": false,
        "custom": "",
        "customPrivate": false,
        "strictDateValidation": false,
        "multiple": false,
        "unique": false
      },
      "allowCalculateOverride": false,
      "encrypted": false,
      "showCharCount": false,
      "showWordCount": false,
      "allowMultipleMasks": false,
      "addons": [],
      "id": "eepq13d"
    },
    {
      "reference": false,
      "form": "6270dc5056f4af00183bc1ae",
      "label": "Residenza",
      "input": true,
      "type": "form",
      "reorder": false,
      "tableView": true,
      "alwaysEnabled": false,
      "key": "address",
      "mask": false,
      "placeholder": "",
      "prefix": "",
      "customClass": "",
      "suffix": "",
      "multiple": false,
      "defaultValue": null,
      "protected": false,
      "unique": false,
      "persistent": true,
      "hidden": false,
      "clearOnHide": true,
      "refreshOn": "",
      "redrawOn": "",
      "modalEdit": false,
      "dataGridLabel": false,
      "labelPosition": "top",
      "description": "",
      "errorLabel": "",
      "tooltip": "",
      "hideLabel": false,
      "tabindex": "",
      "disabled": false,
      "autofocus": false,
      "dbIndex": false,
      "customDefaultValue": "",
      "calculateValue": "",
      "calculateServer": false,
      "widget": null,
      "validateOn": "change",
      "validate": {
        "required": false,
        "custom": "",
        "customPrivate": false,
        "strictDateValidation": false,
        "multiple": false,
        "unique": false
      },
      "conditional": {
        "show": null,
        "when": null,
        "eq": ""
      },
      "overlay": {
        "style": "",
        "left": "",
        "top": "",
        "width": "",
        "height": ""
      },
      "allowCalculateOverride": false,
      "encrypted": false,
      "showCharCount": false,
      "showWordCount": false,
      "allowMultipleMasks": false,
      "addons": [],
      "src": "",
      "path": "",
      "id": "e9ho0v8"
    },
    {
      "label": "HTML",
      "labelWidth": "",
      "labelMargin": "",
      "tag": "p",
      "className": "",
      "attrs": [
        {
          "attr": "",
          "value": ""
        }
      ],
      "content": "<h5>Contatti</h5>",
      "refreshOnChange": false,
      "customClass": "",
      "hidden": false,
      "modalEdit": false,
      "key": "html10",
      "tags": [],
      "conditional": {
        "show": null,
        "when": null,
        "eq": "",
        "json": ""
      },
      "customConditional": "",
      "logic": [],
      "overlay": {
        "style": "",
        "page": "",
        "left": "",
        "top": "",
        "width": "",
        "height": ""
      },
      "type": "htmlelement",
      "input": false,
      "tableView": false,
      "keyModified": true,
      "placeholder": "",
      "prefix": "",
      "suffix": "",
      "multiple": false,
      "defaultValue": null,
      "protected": false,
      "unique": false,
      "persistent": false,
      "clearOnHide": true,
      "refreshOn": "",
      "redrawOn": "",
      "dataGridLabel": false,
      "labelPosition": "top",
      "description": "",
      "errorLabel": "",
      "tooltip": "",
      "hideLabel": false,
      "tabindex": "",
      "disabled": false,
      "autofocus": false,
      "dbIndex": false,
      "customDefaultValue": "",
      "calculateValue": "",
      "calculateServer": false,
      "widget": null,
      "validateOn": "change",
      "validate": {
        "required": false,
        "custom": "",
        "customPrivate": false,
        "strictDateValidation": false,
        "multiple": false,
        "unique": false
      },
      "allowCalculateOverride": false,
      "encrypted": false,
      "showCharCount": false,
      "showWordCount": false,
      "allowMultipleMasks": false,
      "addons": [],
      "id": "eomqnmg"
    },
    {
      "label": "Columns",
      "labelWidth": "",
      "labelMargin": "",
      "columns": [
        {
          "components": [
            {
              "label": "Numero di telefono cellulare",
              "placeholder": "381 4576367",
              "inputMask": "",
              "tableView": true,
              "validate": {
                "required": true,
                "custom": "",
                "customPrivate": false,
                "strictDateValidation": false,
                "multiple": false,
                "unique": false,
                "minLength": "",
                "maxLength": "",
                "pattern": ""
              },
              "key": "cell_number",
              "type": "textfield",
              "input": true,
              "prefix": "",
              "customClass": "",
              "suffix": "",
              "multiple": false,
              "defaultValue": null,
              "protected": false,
              "unique": false,
              "persistent": true,
              "hidden": false,
              "clearOnHide": true,
              "refreshOn": "",
              "redrawOn": "",
              "modalEdit": false,
              "dataGridLabel": false,
              "labelPosition": "top",
              "description": "",
              "errorLabel": "",
              "tooltip": "",
              "hideLabel": false,
              "tabindex": "",
              "disabled": false,
              "autofocus": false,
              "dbIndex": false,
              "customDefaultValue": "",
              "calculateValue": "",
              "calculateServer": false,
              "widget": {
                "type": "input"
              },
              "validateOn": "change",
              "conditional": {
                "show": null,
                "when": null,
                "eq": ""
              },
              "overlay": {
                "style": "",
                "left": "",
                "top": "",
                "width": "",
                "height": ""
              },
              "allowCalculateOverride": false,
              "encrypted": false,
              "showCharCount": false,
              "showWordCount": false,
              "allowMultipleMasks": false,
              "addons": [],
              "mask": false,
              "inputType": "text",
              "inputFormat": "plain",
              "displayMask": "",
              "spellcheck": true,
              "truncateMultipleSpaces": false,
              "id": "eoagvpm"
            }
          ],
          "width": 6,
          "offset": 0,
          "push": 0,
          "pull": 0,
          "size": "md",
          "currentWidth": 6
        },
        {
          "components": [
            {
              "label": "Numero di telefono fisso",
              "labelPosition": "top",
              "placeholder": "0461 5535367",
              "description": "",
              "tooltip": "",
              "prefix": "",
              "suffix": "",
              "widget": {
                "type": "input"
              },
              "inputMask": "",
              "displayMask": "",
              "applyMaskOn": "change",
              "allowMultipleMasks": false,
              "customClass": "",
              "tabindex": "",
              "autocomplete": "",
              "hidden": false,
              "hideLabel": false,
              "showWordCount": false,
              "showCharCount": false,
              "mask": false,
              "autofocus": false,
              "spellcheck": true,
              "disabled": false,
              "tableView": true,
              "modalEdit": false,
              "multiple": false,
              "persistent": true,
              "inputFormat": "plain",
              "protected": false,
              "dbIndex": false,
              "case": "",
              "truncateMultipleSpaces": false,
              "encrypted": false,
              "redrawOn": "",
              "clearOnHide": true,
              "customDefaultValue": "",
              "calculateValue": "",
              "calculateServer": false,
              "allowCalculateOverride": false,
              "validateOn": "change",
              "validate": {
                "required": false,
                "pattern": "",
                "customMessage": "",
                "custom": "",
                "customPrivate": false,
                "json": "",
                "minLength": "",
                "maxLength": "",
                "strictDateValidation": false,
                "multiple": false,
                "unique": false
              },
              "unique": false,
              "errorLabel": "",
              "errors": "",
              "key": "phone_number",
              "tags": [],
              "conditional": {
                "show": null,
                "when": null,
                "eq": "",
                "json": ""
              },
              "customConditional": "",
              "logic": [],
              "overlay": {
                "style": "",
                "page": "",
                "left": "",
                "top": "",
                "width": "",
                "height": ""
              },
              "type": "textfield",
              "input": true,
              "refreshOn": "",
              "dataGridLabel": false,
              "addons": [],
              "inputType": "text",
              "id": "ecgv4c",
              "defaultValue": ""
            }
          ],
          "width": 6,
          "offset": 0,
          "push": 0,
          "pull": 0,
          "size": "md",
          "currentWidth": 6
        },
        {
          "components": [
            {
              "label": "Indirizzo email",
              "labelPosition": "top",
              "labelWidth": "",
              "labelMargin": "",
              "placeholder": "mario.rossi@example.mail",
              "description": "",
              "tooltip": "",
              "prefix": "",
              "suffix": "",
              "widget": {
                "type": "input"
              },
              "displayMask": "",
              "customClass": "",
              "tabindex": "",
              "autocomplete": "",
              "hidden": false,
              "hideLabel": false,
              "mask": false,
              "autofocus": false,
              "spellcheck": true,
              "disabled": false,
              "tableView": true,
              "modalEdit": false,
              "multiple": false,
              "persistent": true,
              "inputFormat": "plain",
              "protected": false,
              "dbIndex": false,
              "case": "",
              "truncateMultipleSpaces": false,
              "encrypted": false,
              "redrawOn": "",
              "clearOnHide": true,
              "customDefaultValue": "",
              "calculateValue": "",
              "calculateServer": false,
              "allowCalculateOverride": false,
              "validateOn": "change",
              "validate": {
                "required": true,
                "minLength": "",
                "maxLength": "",
                "pattern": "",
                "customMessage": "Non hai inserito una mail valida",
                "custom": "",
                "customPrivate": false,
                "json": "",
                "strictDateValidation": false,
                "multiple": false,
                "unique": false
              },
              "unique": false,
              "kickbox": {
                "enabled": false
              },
              "errorLabel": "Non hai inserito una mail valida",
              "errors": "",
              "key": "email_address",
              "tags": [],
              "conditional": {
                "show": null,
                "when": null,
                "eq": "",
                "json": ""
              },
              "customConditional": "",
              "logic": [],
              "overlay": {
                "style": "",
                "page": "",
                "left": "",
                "top": "",
                "width": "",
                "height": ""
              },
              "type": "email",
              "input": true,
              "reorder": false,
              "alwaysEnabled": false,
              "keyModified": true,
              "refreshOn": "",
              "dataGridLabel": false,
              "showCharCount": false,
              "showWordCount": false,
              "allowMultipleMasks": false,
              "addons": [],
              "inputType": "email",
              "inputMask": "",
              "id": "exnhs4",
              "defaultValue": ""
            }
          ],
          "size": "md",
          "width": 12,
          "offset": 0,
          "push": 0,
          "pull": 0,
          "currentWidth": 12
        }
      ],
      "autoAdjust": false,
      "customClass": "",
      "hidden": false,
      "hideLabel": false,
      "modalEdit": false,
      "key": "columns",
      "tags": [],
      "conditional": {
        "show": null,
        "when": null,
        "eq": "",
        "json": ""
      },
      "customConditional": "",
      "logic": [],
      "overlay": {
        "style": "",
        "page": "",
        "left": "",
        "top": "",
        "width": "",
        "height": ""
      },
      "type": "columns",
      "input": false,
      "placeholder": "",
      "prefix": "",
      "suffix": "",
      "multiple": false,
      "defaultValue": null,
      "protected": false,
      "unique": false,
      "persistent": false,
      "clearOnHide": false,
      "refreshOn": "",
      "redrawOn": "",
      "tableView": false,
      "dataGridLabel": false,
      "labelPosition": "top",
      "description": "",
      "errorLabel": "",
      "tooltip": "",
      "tabindex": "",
      "disabled": false,
      "autofocus": false,
      "dbIndex": false,
      "customDefaultValue": "",
      "calculateValue": "",
      "calculateServer": false,
      "widget": null,
      "validateOn": "change",
      "validate": {
        "required": false,
        "custom": "",
        "customPrivate": false,
        "strictDateValidation": false,
        "multiple": false,
        "unique": false
      },
      "allowCalculateOverride": false,
      "encrypted": false,
      "showCharCount": false,
      "showWordCount": false,
      "allowMultipleMasks": false,
      "addons": [],
      "tree": false,
      "lazyLoad": false,
      "id": "ewsvnbb"
    },
    {
      "type": "button",
      "label": "Submit",
      "key": "submit",
      "size": "md",
      "block": false,
      "action": "submit",
      "disableOnInvalid": true,
      "theme": "primary",
      "input": true,
      "placeholder": "",
      "prefix": "",
      "customClass": "",
      "suffix": "",
      "multiple": false,
      "defaultValue": null,
      "protected": false,
      "unique": false,
      "persistent": false,
      "hidden": false,
      "clearOnHide": true,
      "refreshOn": "",
      "redrawOn": "",
      "tableView": false,
      "modalEdit": false,
      "dataGridLabel": true,
      "labelPosition": "top",
      "description": "",
      "errorLabel": "",
      "tooltip": "",
      "hideLabel": false,
      "tabindex": "",
      "disabled": false,
      "autofocus": false,
      "dbIndex": false,
      "customDefaultValue": "",
      "calculateValue": "",
      "calculateServer": false,
      "widget": {
        "type": "input"
      },
      "validateOn": "change",
      "validate": {
        "required": false,
        "custom": "",
        "customPrivate": false,
        "strictDateValidation": false,
        "multiple": false,
        "unique": false
      },
      "conditional": {
        "show": null,
        "when": null,
        "eq": ""
      },
      "overlay": {
        "style": "",
        "left": "",
        "top": "",
        "width": "",
        "height": ""
      },
      "allowCalculateOverride": false,
      "encrypted": false,
      "showCharCount": false,
      "showWordCount": false,
      "allowMultipleMasks": false,
      "addons": [],
      "leftIcon": "",
      "rightIcon": "",
      "id": "e4n00xh"
    }
  ],
  "tags": [
    "component"
  ],
  "_id": "624e8bb556f4af00183434f3",
  "title": "OC - Richiedente",
  "name": "OC - Richiedente",
  "description": "Una anagrafica modificata con l'aggiunta di contatti tra cui l'email e il telefono fisso e non",
  "path": "applicant_contacts",
  "modified": "2024-01-23T13:59:11.724Z",
  "created": "2022-04-07T06:59:01.050Z",
  "__v": 30
}
