{
  "id": "daa0f528-b582-4d1c-9691-e226ac443424",
  "tenant_id": "60e35f02-1509-408c-b101-3b1a28109329",
  "active": true,
  "code": "PAGAMENTO_OPENCITY",
  "description": "descrizione test",
  "splitted": true,
  "split": [
    {
      "split_code": "c_1",
      "split_amount": 16.0,
      "split_kind": "9",
      "split_entry_code": "123",
      "split_entry_acc": "123"
    },
    {
      "split_code": "c_2",
      "split_amount": 0.5,
      "split_kind": "9",
      "split_entry_code": "123",
      "split_entry_acc": "123"
    }
  ]
}
