notice_number,iuv,amount,reason,created_at,expire_at,creditor_name,creditor_fiscal_code,debtor_fiscal_code,debtor_email
002760000000001046,760000000001046,"30,00",Pagamento di test,06-01-2024,30-06-2024,Comune di Bugliano,123456789,MCCRED83s13a234g,my_email@email.it
002760000000001046,760000000001046,"30,00",Pagamento di test,07-01-2024,31-11-2024,Comune di Bugliano,123456789,CLNVTR76P01G822Q,
