name,text
Trattamento dati personali:,"<p>L’Ente titolare del trattamento tratta i dati personali forniti e liberamente comunicati, nel rispetto delle disposizioni del Regolamento UE 2016/679</p>
<p>
L’Ente mette a disposizione dell’interessato tutte le informazioni di dettaglio in merito al trattamento dei dati personali che lo riguardano, così come previsto e disciplinato dagli art. 12, 13, 14 del Regolamento UE 2016/679
</p>
<p>informativa completa alla sezione “<a target='_blank' href='/Privacy'>privacy</a>” del sito istituzionale</p>"
