{
  "app_id": "symfony-core:2.15.2",
  "app_version": "2.15.2",
  "attachments": [],
  "author_id": null,
  "clicked_at": null,
  "created_at": "2023-04-13T11:53:07+02:00",
  "email": "email@example.com",
  "event_created_at": "2023-04-13T11:53:07+02:00",
  "event_id": "7169a538-576f-49f9-8867-9c2d1133a3de",
  "event_version": 2,
  "id": "24263c0c-43fe-47a8-b311-588e3b854a19",
  "message": "Gentile <strong>********</strong>,<br /> le comunichiamo che la sua richiesta per il servizio <strong>Richiesta di accesso agli atti in materia edilizia</strong> è in attesa di pagamento. Il numero di richiesta è <strong>******</strong>. Faccia sempre riferimento a questo identificativo in caso di comunicazioni relative alla Sua richiesta.<br />La ringraziamo per la collaborazione.",
  "path": "/messages",
  "protocol_number": null,
  "protocol_required": false,
  "protocolled_at": null,
  "read_at": null,
  "related_entity_id": "e91df9e4-7d24-4849-a95a-4d65637e5ba9",
  "remote_collection": {
    "id": "27874fcd-33ba-4db4-9bdc-d86252551a32",
    "type": "service"
  },
  "receivers_ids": [
    "5b00796e-ef10-4c98-b9f5-b0f7ffd7a17d"
  ],
  "sent_at": "2023-04-13T11:53:07+02:00",
  "source_type": "http",
  "subject": "La richiesta n. e91df9e4-7d24-4849-a95a-4d65637e5ba9 è stata aggiornata",
  "tenant_id": "60e35f02-1509-408c-b101-3b1a28109329",
  "timestamp": "2023-04-13T09:53:07.201727820Z",
  "transmission_type": "outbound",
  "visibility": "applicant"
}
