{
  "parent": "minecraft:item/handheld",
  "textures": {
    "layer0": "minecraft:item/stone_pickaxe"
  },
  "overrides": [
    {
      "predicate": {
        "custom_model_data": 1
      },
      "model": "custom:item/pickaxe_1"
    },
    {
      "predicate": {
        "custom_model_data": 2
      },
      "model": "custom:item/pickaxe_2"
    },
    {
      "predicate": {
        "custom_model_data": 3
      },
      "model": "custom:item/pickaxe_3"
    },
    {
      "predicate": {
        "custom_model_data": 4
      },
      "model": "custom:item/pickaxe_4"
    },
    {
      "predicate": {
        "custom_model_data": 5
      },
      "model": "custom:item/pickaxe_5"
    },
    {
      "predicate": {
        "custom_model_data": 6
      },
      "model": "custom:item/pickaxe_6"
    },
    {
      "predicate": {
        "custom_model_data": 7
      },
      "model": "custom:item/pickaxe_7"
    },
    {
      "predicate": {
        "custom_model_data": 8
      },
      "model": "custom:item/pickaxe_8"
    },
    {
      "predicate": {
        "custom_model_data": 9
      },
      "model": "custom:item/pickaxe_9"
    },
    {
      "predicate": {
        "custom_model_data": 10
      },
      "model": "custom:item/pickaxe_10"
    },
    {
      "predicate": {
        "custom_model_data": 11
      },
      "model": "custom:item/pickaxe_11"
    },
    {
      "predicate": {
        "custom_model_data": 12
      },
      "model": "custom:item/pickaxe_12"
    },
    {
      "predicate": {
        "custom_model_data": 13
      },
      "model": "custom:item/pickaxe_13"
    },
    {
      "predicate": {
        "custom_model_data": 14
      },
      "model": "custom:item/pickaxe_14"
    },
    {
      "predicate": {
        "custom_model_data": 15
      },
      "model": "custom:item/pickaxe_15"
    },
    {
      "predicate": {
        "custom_model_data": 16
      },
      "model": "custom:item/pickaxe_16"
    },
    {
      "predicate": {
        "custom_model_data": 17
      },
      "model": "custom:item/pickaxe_17"
    }
  ]
}