module gitlab.com/open-source-archie/tools/frontend

go 1.17

require (
	github.com/gorilla/mux v1.8.0
	github.com/lib/pq v1.10.4
	go.uber.org/zap v1.20.0
	google.golang.org/grpc v1.43.0
	gopkg.in/yaml.v2 v2.4.0
)

require (
	github.com/golang/protobuf v1.4.3 // indirect
	go.uber.org/atomic v1.7.0 // indirect
	go.uber.org/multierr v1.6.0 // indirect
	golang.org/x/net v0.0.0-20210405180319-a5a99cb37ef4 // indirect
	golang.org/x/sys v0.0.0-20210510120138-977fb7262007 // indirect
	golang.org/x/text v0.3.3 // indirect
	google.golang.org/genproto v0.0.0-20200526211855-cb27e3aa2013 // indirect
	google.golang.org/protobuf v1.25.0 // indirect
)
