{
  "Ouvrages": "https://data.montpellier3m.fr/sites/default/files/ressources/VilleMTP_MTP_ParkingOuv.csv",
  "Veloparcs": "https://data.montpellier3m.fr/sites/default/files/ressources/MMM_MMM_VeloParc.csv"
}
