EESchema Schematic File Version 4
LIBS:OLR_TRACK1-cache
EELAYER 29 0
EELAYER END
$Descr A4 11693 8268
encoding utf-8
Sheet 1 1
Title ""
Date ""
Rev ""
Comp ""
Comment1 ""
Comment2 ""
Comment3 ""
Comment4 ""
$EndDescr
$Comp
L SparkFun-LED:WS2812B D1
U 1 1 5CF21E15
P 3350 1500
F 0 "D1" H 3350 2060 45  0000 C CNN
F 1 "WS2812B" H 3350 1976 45  0000 C CNN
F 2 "share:LED_WS2812B-PLCC4_modif" H 3350 1950 20  0001 C CNN
F 3 "" H 3350 1500 50  0001 C CNN
F 4 "DIO-12503" H 3350 1881 60  0000 C CNN "Field4"
	1    3350 1500
	1    0    0    -1  
$EndComp
Wire Wire Line
	1650 1800 2250 1800
Wire Wire Line
	3900 1800 3900 1600
Wire Wire Line
	2650 1300 2650 900 
Wire Wire Line
	2650 1300 2800 1300
Text Notes 3950 1150 0    50   ~ 0
DOUT
$Comp
L SparkFun-LED:WS2812B D2
U 1 1 5CF2C9A7
P 4950 1500
F 0 "D2" H 4950 2060 45  0000 C CNN
F 1 "WS2812B" H 4950 1976 45  0000 C CNN
F 2 "share:LED_WS2812B-PLCC4_modif" H 4950 1950 20  0001 C CNN
F 3 "" H 4950 1500 50  0001 C CNN
F 4 "DIO-12503" H 4950 1881 60  0000 C CNN "Field4"
	1    4950 1500
	1    0    0    -1  
$EndComp
$Comp
L SparkFun-LED:WS2812B D3
U 1 1 5CF2D73A
P 6500 1500
F 0 "D3" H 6500 2060 45  0000 C CNN
F 1 "WS2812B" H 6500 1976 45  0000 C CNN
F 2 "share:LED_WS2812B-PLCC4_modif" H 6500 1950 20  0001 C CNN
F 3 "" H 6500 1500 50  0001 C CNN
F 4 "DIO-12503" H 6500 1881 60  0000 C CNN "Field4"
	1    6500 1500
	1    0    0    -1  
$EndComp
$Comp
L SparkFun-LED:WS2812B D4
U 1 1 5CF2E44C
P 8000 1500
F 0 "D4" H 8000 2060 45  0000 C CNN
F 1 "WS2812B" H 8000 1976 45  0000 C CNN
F 2 "share:LED_WS2812B-PLCC4_modif" H 8000 1950 20  0001 C CNN
F 3 "" H 8000 1500 50  0001 C CNN
F 4 "DIO-12503" H 8000 1881 60  0000 C CNN "Field4"
	1    8000 1500
	1    0    0    -1  
$EndComp
$Comp
L SparkFun-LED:WS2812B D5
U 1 1 5CF2F2FF
P 9600 1500
F 0 "D5" H 9600 2060 45  0000 C CNN
F 1 "WS2812B" H 9600 1976 45  0000 C CNN
F 2 "share:LED_WS2812B-PLCC4_modif" H 9600 1950 20  0001 C CNN
F 3 "" H 9600 1500 50  0001 C CNN
F 4 "DIO-12503" H 9600 1881 60  0000 C CNN "Field4"
	1    9600 1500
	1    0    0    -1  
$EndComp
$Comp
L SparkFun-LED:WS2812B D6
U 1 1 5CF36B0B
P 3350 2750
F 0 "D6" H 3350 3310 45  0000 C CNN
F 1 "WS2812B" H 3350 3226 45  0000 C CNN
F 2 "share:LED_WS2812B-PLCC4_modif" H 3350 3200 20  0001 C CNN
F 3 "" H 3350 2750 50  0001 C CNN
F 4 "DIO-12503" H 3350 3131 60  0000 C CNN "Field4"
	1    3350 2750
	1    0    0    -1  
$EndComp
Wire Wire Line
	1650 3050 2150 3050
Wire Wire Line
	3900 3050 3900 2850
Wire Wire Line
	2650 2550 2800 2550
Text Notes 3950 2400 0    50   ~ 0
DOUT
$Comp
L SparkFun-LED:WS2812B D7
U 1 1 5CF36B1C
P 4950 2750
F 0 "D7" H 4950 3310 45  0000 C CNN
F 1 "WS2812B" H 4950 3226 45  0000 C CNN
F 2 "share:LED_WS2812B-PLCC4_modif" H 4950 3200 20  0001 C CNN
F 3 "" H 4950 2750 50  0001 C CNN
F 4 "DIO-12503" H 4950 3131 60  0000 C CNN "Field4"
	1    4950 2750
	1    0    0    -1  
$EndComp
$Comp
L SparkFun-LED:WS2812B D8
U 1 1 5CF36B23
P 6500 2750
F 0 "D8" H 6500 3310 45  0000 C CNN
F 1 "WS2812B" H 6500 3226 45  0000 C CNN
F 2 "share:LED_WS2812B-PLCC4_modif" H 6500 3200 20  0001 C CNN
F 3 "" H 6500 2750 50  0001 C CNN
F 4 "DIO-12503" H 6500 3131 60  0000 C CNN "Field4"
	1    6500 2750
	1    0    0    -1  
$EndComp
$Comp
L SparkFun-LED:WS2812B D9
U 1 1 5CF36B2A
P 8000 2750
F 0 "D9" H 8000 3310 45  0000 C CNN
F 1 "WS2812B" H 8000 3226 45  0000 C CNN
F 2 "share:LED_WS2812B-PLCC4_modif" H 8000 3200 20  0001 C CNN
F 3 "" H 8000 2750 50  0001 C CNN
F 4 "DIO-12503" H 8000 3131 60  0000 C CNN "Field4"
	1    8000 2750
	1    0    0    -1  
$EndComp
$Comp
L SparkFun-LED:WS2812B D10
U 1 1 5CF36B31
P 9600 2750
F 0 "D10" H 9600 3310 45  0000 C CNN
F 1 "WS2812B" H 9600 3226 45  0000 C CNN
F 2 "share:LED_WS2812B-PLCC4_modif" H 9600 3200 20  0001 C CNN
F 3 "" H 9600 2750 50  0001 C CNN
F 4 "DIO-12503" H 9600 3131 60  0000 C CNN "Field4"
	1    9600 2750
	1    0    0    -1  
$EndComp
Wire Wire Line
	2650 900  4150 900 
Wire Wire Line
	9050 900  9050 1300
Wire Wire Line
	7450 1300 7450 900 
Connection ~ 7450 900 
Wire Wire Line
	7450 900  8800 900 
Wire Wire Line
	5950 1300 5950 900 
Connection ~ 5950 900 
Wire Wire Line
	5950 900  7200 900 
Wire Wire Line
	4400 1300 4400 900 
Connection ~ 4400 900 
Wire Wire Line
	4400 900  5700 900 
Wire Wire Line
	2650 2150 4200 2150
Wire Wire Line
	9000 2150 9000 2550
Wire Wire Line
	7450 2550 7450 2150
Connection ~ 7450 2150
Wire Wire Line
	7450 2150 8800 2150
Wire Wire Line
	5950 2550 5950 2150
Connection ~ 5950 2150
Wire Wire Line
	5950 2150 7250 2150
Wire Wire Line
	4400 2500 4400 2150
Connection ~ 4400 2150
Wire Wire Line
	4400 2150 5750 2150
Wire Wire Line
	3900 1800 4150 1800
Wire Wire Line
	10150 1800 10150 1600
Connection ~ 3900 1800
Wire Wire Line
	8550 1600 8550 1800
Connection ~ 8550 1800
Wire Wire Line
	8550 1800 8800 1800
Wire Wire Line
	7050 1600 7050 1800
Connection ~ 7050 1800
Wire Wire Line
	7050 1800 7200 1800
Wire Wire Line
	5500 1600 5500 1800
Connection ~ 5500 1800
Wire Wire Line
	5500 1800 5700 1800
Wire Wire Line
	1650 1800 1650 3050
Wire Wire Line
	3900 3050 4200 3050
Wire Wire Line
	10200 3050 10200 2850
Wire Wire Line
	10200 2850 10150 2850
Connection ~ 3900 3050
Wire Wire Line
	8550 2850 8550 3050
Connection ~ 8550 3050
Wire Wire Line
	8550 3050 8800 3050
Wire Wire Line
	7050 2850 7050 3050
Connection ~ 7050 3050
Wire Wire Line
	7050 3050 7250 3050
Wire Wire Line
	5500 2850 5500 3050
Connection ~ 5500 3050
Wire Wire Line
	5500 3050 5750 3050
Wire Wire Line
	3900 1300 3950 1300
Wire Wire Line
	3950 1300 3950 1600
Wire Wire Line
	5500 1300 5550 1300
Wire Wire Line
	5550 1300 5550 1600
Wire Wire Line
	7050 1300 7100 1300
Wire Wire Line
	7100 1300 7100 1600
Wire Wire Line
	8550 1300 8600 1300
Wire Wire Line
	8600 1300 8600 1600
Wire Wire Line
	10150 1300 10550 1300
Wire Wire Line
	10550 1300 10550 1950
Wire Wire Line
	10550 1950 2450 1950
Wire Wire Line
	2450 1950 2450 2850
Wire Wire Line
	2450 2850 2800 2850
Wire Wire Line
	3900 2550 4000 2550
Wire Wire Line
	4000 2550 4000 2850
Wire Wire Line
	5500 2550 5600 2550
Wire Wire Line
	5600 2550 5600 2850
Wire Wire Line
	7050 2550 7150 2550
Wire Wire Line
	7150 2550 7150 2850
Wire Wire Line
	8550 2550 8650 2550
Wire Wire Line
	8650 2550 8650 2850
Wire Wire Line
	10150 2550 10550 2550
Wire Wire Line
	9000 2550 9050 2550
$Comp
L pspice:CAP C?
U 1 1 5D9D56A2
P 8800 2450
F 0 "C?" H 8978 2496 50  0000 L CNN
F 1 "CAP" H 8978 2405 50  0000 L CNN
F 2 "" H 8800 2450 50  0001 C CNN
F 3 "~" H 8800 2450 50  0001 C CNN
	1    8800 2450
	1    0    0    -1  
$EndComp
Wire Wire Line
	8800 2200 8800 2150
Connection ~ 8800 2150
Wire Wire Line
	8800 2150 9000 2150
$Comp
L pspice:CAP C?
U 1 1 5D9E31E4
P 7250 2450
F 0 "C?" H 7428 2496 50  0000 L CNN
F 1 "CAP" H 7428 2405 50  0000 L CNN
F 2 "" H 7250 2450 50  0001 C CNN
F 3 "~" H 7250 2450 50  0001 C CNN
	1    7250 2450
	1    0    0    -1  
$EndComp
Wire Wire Line
	7250 2200 7250 2150
Connection ~ 7250 2150
Wire Wire Line
	7250 2150 7450 2150
Wire Wire Line
	7150 2850 7450 2850
Wire Wire Line
	8650 2850 9050 2850
Wire Wire Line
	7250 2700 7250 3050
Connection ~ 7250 3050
Wire Wire Line
	7250 3050 8550 3050
Wire Wire Line
	8800 2700 8800 3050
Connection ~ 8800 3050
Wire Wire Line
	8800 3050 10100 3050
Wire Wire Line
	4000 2850 4400 2850
Wire Wire Line
	5600 2850 5950 2850
$Comp
L pspice:CAP C?
U 1 1 5D9F5B64
P 5750 2450
F 0 "C?" H 5928 2496 50  0000 L CNN
F 1 "CAP" H 5928 2405 50  0000 L CNN
F 2 "" H 5750 2450 50  0001 C CNN
F 3 "~" H 5750 2450 50  0001 C CNN
	1    5750 2450
	1    0    0    -1  
$EndComp
$Comp
L pspice:CAP C?
U 1 1 5D9F6310
P 4200 2450
F 0 "C?" H 4378 2496 50  0000 L CNN
F 1 "CAP" H 4378 2405 50  0000 L CNN
F 2 "" H 4200 2450 50  0001 C CNN
F 3 "~" H 4200 2450 50  0001 C CNN
	1    4200 2450
	1    0    0    -1  
$EndComp
Wire Wire Line
	4200 2200 4200 2150
Connection ~ 4200 2150
Wire Wire Line
	4200 2150 4400 2150
Wire Wire Line
	5750 2200 5750 2150
Connection ~ 5750 2150
Wire Wire Line
	5750 2150 5950 2150
Wire Wire Line
	4200 2700 4200 3050
Connection ~ 4200 3050
Wire Wire Line
	4200 3050 5500 3050
Wire Wire Line
	5750 2700 5750 3050
Connection ~ 5750 3050
Wire Wire Line
	5750 3050 7050 3050
Wire Wire Line
	3950 1600 4400 1600
Wire Wire Line
	5550 1600 5950 1600
Wire Wire Line
	7100 1600 7450 1600
Wire Wire Line
	8600 1600 9050 1600
$Comp
L pspice:CAP C?
U 1 1 5DA12CF3
P 8800 1200
F 0 "C?" H 8978 1246 50  0000 L CNN
F 1 "CAP" H 8978 1155 50  0000 L CNN
F 2 "" H 8800 1200 50  0001 C CNN
F 3 "~" H 8800 1200 50  0001 C CNN
	1    8800 1200
	1    0    0    -1  
$EndComp
$Comp
L pspice:CAP C?
U 1 1 5DA134D8
P 7200 1200
F 0 "C?" H 7378 1246 50  0000 L CNN
F 1 "CAP" H 7378 1155 50  0000 L CNN
F 2 "" H 7200 1200 50  0001 C CNN
F 3 "~" H 7200 1200 50  0001 C CNN
	1    7200 1200
	1    0    0    -1  
$EndComp
$Comp
L pspice:CAP C?
U 1 1 5DA13E44
P 5700 1150
F 0 "C?" H 5878 1196 50  0000 L CNN
F 1 "CAP" H 5878 1105 50  0000 L CNN
F 2 "" H 5700 1150 50  0001 C CNN
F 3 "~" H 5700 1150 50  0001 C CNN
	1    5700 1150
	1    0    0    -1  
$EndComp
Connection ~ 5700 900 
Wire Wire Line
	5700 900  5950 900 
$Comp
L pspice:CAP C?
U 1 1 5DA145EE
P 4150 1200
F 0 "C?" H 4328 1246 50  0000 L CNN
F 1 "CAP" H 4328 1155 50  0000 L CNN
F 2 "" H 4150 1200 50  0001 C CNN
F 3 "~" H 4150 1200 50  0001 C CNN
	1    4150 1200
	1    0    0    -1  
$EndComp
Wire Wire Line
	4150 1450 4150 1800
Connection ~ 4150 1800
Wire Wire Line
	4150 1800 5500 1800
Wire Wire Line
	5700 1400 5700 1800
Connection ~ 5700 1800
Wire Wire Line
	5700 1800 7050 1800
Wire Wire Line
	7200 1450 7200 1800
Connection ~ 7200 1800
Wire Wire Line
	7200 1800 8550 1800
Wire Wire Line
	8800 1450 8800 1800
Connection ~ 8800 1800
Wire Wire Line
	8800 1800 10150 1800
Wire Wire Line
	8800 950  8800 900 
Connection ~ 8800 900 
Wire Wire Line
	8800 900  9050 900 
Wire Wire Line
	4150 950  4150 900 
Connection ~ 4150 900 
Wire Wire Line
	4150 900  4400 900 
Wire Wire Line
	7200 950  7200 900 
Connection ~ 7200 900 
Wire Wire Line
	7200 900  7450 900 
$Comp
L SparkFun-Connectors:CONN_03 J?
U 1 1 5DA2B4C8
P 10300 3700
F 0 "J?" H 10072 3705 45  0000 R CNN
F 1 "CONN_03" H 10072 3789 45  0000 R CNN
F 2 "1X03" H 10300 4100 20  0001 C CNN
F 3 "" H 10300 3700 50  0001 C CNN
F 4 "XXX-00000" H 10072 3884 60  0000 R CNN "Campo4"
	1    10300 3700
	-1   0    0    1   
$EndComp
$Comp
L SparkFun-Connectors:CONN_03 J?
U 1 1 5DA2C128
P 950 4400
F 0 "J?" H 908 4910 45  0000 C CNN
F 1 "CONN_03" H 908 4826 45  0000 C CNN
F 2 "1X03" H 950 4800 20  0001 C CNN
F 3 "" H 950 4400 50  0001 C CNN
F 4 "XXX-00000" H 908 4731 60  0000 C CNN "Campo4"
	1    950  4400
	1    0    0    -1  
$EndComp
Wire Wire Line
	9000 2550 9000 3900
Connection ~ 9000 2550
Wire Wire Line
	10550 2550 10550 3350
Wire Wire Line
	10550 3350 9500 3350
$Comp
L SparkFun-Connectors:CONN_03 J?
U 1 1 5DA3B4FD
P 10300 4400
F 0 "J?" H 10072 4405 45  0000 R CNN
F 1 "CONN_03" H 10072 4489 45  0000 R CNN
F 2 "1X03" H 10300 4800 20  0001 C CNN
F 3 "" H 10300 4400 50  0001 C CNN
F 4 "XXX-00000" H 10072 4584 60  0000 R CNN "Campo4"
	1    10300 4400
	-1   0    0    1   
$EndComp
Wire Wire Line
	9500 3350 9500 3600
Wire Wire Line
	9500 4500 10200 4500
Wire Wire Line
	1500 3800 2000 3800
Wire Wire Line
	1500 1600 2800 1600
Wire Wire Line
	1500 1600 1500 3800
$Comp
L SparkFun-Connectors:CONN_03 J?
U 1 1 5DA51B2B
P 950 3700
F 0 "J?" H 908 4210 45  0000 C CNN
F 1 "CONN_03" H 908 4126 45  0000 C CNN
F 2 "1X03" H 950 4100 20  0001 C CNN
F 3 "" H 950 3700 50  0001 C CNN
F 4 "XXX-00000" H 908 4031 60  0000 C CNN "Campo4"
	1    950  3700
	1    0    0    -1  
$EndComp
Wire Wire Line
	10100 3900 10100 4400
Wire Wire Line
	10100 3900 10200 3900
Wire Wire Line
	1050 3700 1300 3700
Wire Wire Line
	1300 3700 1300 3950
Wire Wire Line
	1300 4200 1050 4200
Wire Wire Line
	1300 3950 1650 3950
Wire Wire Line
	1650 3950 1650 3050
Connection ~ 1300 3950
Wire Wire Line
	1300 3950 1300 4200
Connection ~ 1650 3050
Wire Wire Line
	2650 2150 2650 2550
Connection ~ 2650 2550
Wire Wire Line
	2650 2550 2650 3500
Wire Wire Line
	1050 3500 2650 3500
Wire Wire Line
	2650 3500 2650 4400
Wire Wire Line
	2650 4400 2000 4400
Connection ~ 2650 3500
Wire Wire Line
	1050 4300 1500 4300
Wire Wire Line
	1500 4300 1500 3800
Connection ~ 1500 3800
Wire Wire Line
	1050 3600 9500 3600
Connection ~ 9500 3600
Wire Wire Line
	9500 3600 9500 4500
Text Notes 10400 4900 0    118  ~ 0
in
Text Notes 850  3100 0    118  ~ 0
in
Text Notes 10650 3600 0    118  ~ 0
out
Text Notes 800  4650 0    118  ~ 0
out
$Comp
L pspice:CAP C?
U 1 1 5DA89F3E
P 2000 4100
F 0 "C?" H 2178 4146 50  0000 L CNN
F 1 "CAP" H 2178 4055 50  0000 L CNN
F 2 "" H 2000 4100 50  0001 C CNN
F 3 "~" H 2000 4100 50  0001 C CNN
	1    2000 4100
	1    0    0    -1  
$EndComp
$Comp
L pspice:CAP C?
U 1 1 5DA8AB1A
P 8850 4150
F 0 "C?" H 9028 4196 50  0000 L CNN
F 1 "CAP" H 9028 4105 50  0000 L CNN
F 2 "" H 8850 4150 50  0001 C CNN
F 3 "~" H 8850 4150 50  0001 C CNN
	1    8850 4150
	1    0    0    -1  
$EndComp
Wire Wire Line
	9000 3900 9900 3900
Wire Wire Line
	9900 3900 9900 3700
Wire Wire Line
	9900 3700 10200 3700
Wire Wire Line
	9900 4600 9900 3900
Wire Wire Line
	9900 4600 10200 4600
Connection ~ 9900 3900
Wire Wire Line
	8850 4400 10100 4400
Connection ~ 10100 4400
Wire Wire Line
	10100 4400 10200 4400
Wire Wire Line
	8850 3900 9000 3900
Connection ~ 9000 3900
Wire Wire Line
	10100 3900 10100 3050
Connection ~ 10100 3900
Connection ~ 10100 3050
Wire Wire Line
	10100 3050 10200 3050
Wire Wire Line
	2650 1300 2650 2150
Connection ~ 2650 1300
Connection ~ 2650 2150
Wire Wire Line
	2000 3850 2000 3800
Connection ~ 2000 3800
Wire Wire Line
	2000 3800 10200 3800
Wire Wire Line
	2000 4350 2000 4400
Connection ~ 2000 4400
Wire Wire Line
	2000 4400 1050 4400
$Comp
L pspice:CAP C?
U 1 1 5DAC94A5
P 2250 1250
F 0 "C?" H 2428 1296 50  0000 L CNN
F 1 "CAP" H 2428 1205 50  0000 L CNN
F 2 "" H 2250 1250 50  0001 C CNN
F 3 "~" H 2250 1250 50  0001 C CNN
	1    2250 1250
	1    0    0    -1  
$EndComp
$Comp
L pspice:CAP C?
U 1 1 5DAC9EAD
P 2150 2700
F 0 "C?" H 2328 2746 50  0000 L CNN
F 1 "CAP" H 2328 2655 50  0000 L CNN
F 2 "" H 2150 2700 50  0001 C CNN
F 3 "~" H 2150 2700 50  0001 C CNN
	1    2150 2700
	1    0    0    -1  
$EndComp
Wire Wire Line
	2150 2950 2150 3050
Connection ~ 2150 3050
Wire Wire Line
	2150 3050 3900 3050
Wire Wire Line
	2250 1500 2250 1800
Connection ~ 2250 1800
Wire Wire Line
	2250 1800 3900 1800
Wire Wire Line
	2250 1000 2250 900 
Wire Wire Line
	2250 900  2650 900 
Connection ~ 2650 900 
Wire Wire Line
	2150 2150 2650 2150
Wire Wire Line
	2150 2150 2150 2450
$EndSCHEMATC
