G04 #@! TF.GenerationSoftware,KiCad,Pcbnew,(5.1.2)-1*
G04 #@! TF.CreationDate,2019-09-15T09:42:12+02:00*
G04 #@! TF.ProjectId,openLEDrace1,6f70656e-4c45-4447-9261-6365312e6b69,rev?*
G04 #@! TF.SameCoordinates,Original*
G04 #@! TF.FileFunction,Profile,NP*
%FSLAX46Y46*%
G04 Gerber Fmt 4.6, Leading zero omitted, Abs format (unit mm)*
G04 Created by KiCad (PCBNEW (5.1.2)-1) date 2019-09-15 09:42:12*
%MOMM*%
%LPD*%
G04 APERTURE LIST*
%ADD10C,0.150000*%
G04 APERTURE END LIST*
D10*
X69342000Y-129794000D02*
X69342000Y-82804000D01*
X134366000Y-129794000D02*
X69342000Y-129794000D01*
X134366000Y-82804000D02*
X134366000Y-129794000D01*
X69342000Y-82804000D02*
X134366000Y-82804000D01*
M02*
