EESchema Schematic File Version 4
EELAYER 29 0
EELAYER END
$Descr A4 11693 8268
encoding utf-8
Sheet 1 1
Title ""
Date ""
Rev ""
Comp ""
Comment1 ""
Comment2 ""
Comment3 ""
Comment4 ""
$EndDescr
$Comp
L SparkFun-LED:WS2812B D1
U 1 1 5CF21E15
P 3350 1500
F 0 "D1" H 3350 2060 45  0000 C CNN
F 1 "WS2812B" H 3350 1976 45  0000 C CNN
F 2 "share:LED_WS2812B-PLCC4_modif" H 3350 1950 20  0001 C CNN
F 3 "" H 3350 1500 50  0001 C CNN
F 4 "DIO-12503" H 3350 1881 60  0000 C CNN "Field4"
	1    3350 1500
	1    0    0    -1  
$EndComp
$Comp
L SparkFun-Connectors:USB_A_PTH_MALE J1
U 1 1 5CF24133
P 1200 1450
F 0 "J1" H 1200 940 45  0000 C CNN
F 1 "USB_A_PTH_MALE" H 1200 1024 45  0000 C CNN
F 2 "Connectors:USB_A" H 1200 1850 20  0001 C CNN
F 3 "" H 1200 1450 50  0001 C CNN
F 4 "CONN-08367" H 1200 1119 60  0000 C CNN "Field4"
	1    1200 1450
	-1   0    0    1   
$EndComp
$Comp
L SparkFun-Connectors:USB_A_SMT_FEMALE J2
U 1 1 5CF24BB6
P 10800 6000
F 0 "J2" H 10800 6510 45  0000 C CNN
F 1 "USB_A_SMT_FEMALE" H 10800 6426 45  0000 C CNN
F 2 "Connectors:USB_B" H 10800 6400 20  0001 C CNN
F 3 "" H 10800 6000 50  0001 C CNN
F 4 "CONN-09520" H 10800 6331 60  0000 C CNN "Field4"
	1    10800 6000
	1    0    0    -1  
$EndComp
Wire Wire Line
	1450 1300 2650 1300
Wire Wire Line
	1450 1400 2650 1400
Wire Wire Line
	2650 1400 2650 1600
Wire Wire Line
	2650 1600 2800 1600
Wire Wire Line
	1450 1600 1650 1600
Wire Wire Line
	1650 1600 1650 1800
Wire Wire Line
	1650 1800 3900 1800
Wire Wire Line
	3900 1800 3900 1600
Wire Wire Line
	2650 1300 2650 900 
Connection ~ 2650 1300
Wire Wire Line
	2650 1300 2800 1300
Text Notes 3950 1150 0    50   ~ 0
DOUT
$Comp
L SparkFun-LED:WS2812B D2
U 1 1 5CF2C9A7
P 4950 1500
F 0 "D2" H 4950 2060 45  0000 C CNN
F 1 "WS2812B" H 4950 1976 45  0000 C CNN
F 2 "share:LED_WS2812B-PLCC4_modif" H 4950 1950 20  0001 C CNN
F 3 "" H 4950 1500 50  0001 C CNN
F 4 "DIO-12503" H 4950 1881 60  0000 C CNN "Field4"
	1    4950 1500
	1    0    0    -1  
$EndComp
$Comp
L SparkFun-LED:WS2812B D3
U 1 1 5CF2D73A
P 6500 1500
F 0 "D3" H 6500 2060 45  0000 C CNN
F 1 "WS2812B" H 6500 1976 45  0000 C CNN
F 2 "share:LED_WS2812B-PLCC4_modif" H 6500 1950 20  0001 C CNN
F 3 "" H 6500 1500 50  0001 C CNN
F 4 "DIO-12503" H 6500 1881 60  0000 C CNN "Field4"
	1    6500 1500
	1    0    0    -1  
$EndComp
$Comp
L SparkFun-LED:WS2812B D4
U 1 1 5CF2E44C
P 8000 1500
F 0 "D4" H 8000 2060 45  0000 C CNN
F 1 "WS2812B" H 8000 1976 45  0000 C CNN
F 2 "share:LED_WS2812B-PLCC4_modif" H 8000 1950 20  0001 C CNN
F 3 "" H 8000 1500 50  0001 C CNN
F 4 "DIO-12503" H 8000 1881 60  0000 C CNN "Field4"
	1    8000 1500
	1    0    0    -1  
$EndComp
$Comp
L SparkFun-LED:WS2812B D5
U 1 1 5CF2F2FF
P 9600 1500
F 0 "D5" H 9600 2060 45  0000 C CNN
F 1 "WS2812B" H 9600 1976 45  0000 C CNN
F 2 "share:LED_WS2812B-PLCC4_modif" H 9600 1950 20  0001 C CNN
F 3 "" H 9600 1500 50  0001 C CNN
F 4 "DIO-12503" H 9600 1881 60  0000 C CNN "Field4"
	1    9600 1500
	1    0    0    -1  
$EndComp
$Comp
L SparkFun-LED:WS2812B D6
U 1 1 5CF36B0B
P 3350 2750
F 0 "D6" H 3350 3310 45  0000 C CNN
F 1 "WS2812B" H 3350 3226 45  0000 C CNN
F 2 "share:LED_WS2812B-PLCC4_modif" H 3350 3200 20  0001 C CNN
F 3 "" H 3350 2750 50  0001 C CNN
F 4 "DIO-12503" H 3350 3131 60  0000 C CNN "Field4"
	1    3350 2750
	1    0    0    -1  
$EndComp
Wire Wire Line
	1650 3050 3900 3050
Wire Wire Line
	3900 3050 3900 2850
Wire Wire Line
	2650 2550 2650 2150
Wire Wire Line
	2650 2550 2800 2550
Text Notes 3950 2400 0    50   ~ 0
DOUT
$Comp
L SparkFun-LED:WS2812B D7
U 1 1 5CF36B1C
P 4950 2750
F 0 "D7" H 4950 3310 45  0000 C CNN
F 1 "WS2812B" H 4950 3226 45  0000 C CNN
F 2 "share:LED_WS2812B-PLCC4_modif" H 4950 3200 20  0001 C CNN
F 3 "" H 4950 2750 50  0001 C CNN
F 4 "DIO-12503" H 4950 3131 60  0000 C CNN "Field4"
	1    4950 2750
	1    0    0    -1  
$EndComp
$Comp
L SparkFun-LED:WS2812B D8
U 1 1 5CF36B23
P 6500 2750
F 0 "D8" H 6500 3310 45  0000 C CNN
F 1 "WS2812B" H 6500 3226 45  0000 C CNN
F 2 "share:LED_WS2812B-PLCC4_modif" H 6500 3200 20  0001 C CNN
F 3 "" H 6500 2750 50  0001 C CNN
F 4 "DIO-12503" H 6500 3131 60  0000 C CNN "Field4"
	1    6500 2750
	1    0    0    -1  
$EndComp
$Comp
L SparkFun-LED:WS2812B D9
U 1 1 5CF36B2A
P 8000 2750
F 0 "D9" H 8000 3310 45  0000 C CNN
F 1 "WS2812B" H 8000 3226 45  0000 C CNN
F 2 "share:LED_WS2812B-PLCC4_modif" H 8000 3200 20  0001 C CNN
F 3 "" H 8000 2750 50  0001 C CNN
F 4 "DIO-12503" H 8000 3131 60  0000 C CNN "Field4"
	1    8000 2750
	1    0    0    -1  
$EndComp
$Comp
L SparkFun-LED:WS2812B D10
U 1 1 5CF36B31
P 9600 2750
F 0 "D10" H 9600 3310 45  0000 C CNN
F 1 "WS2812B" H 9600 3226 45  0000 C CNN
F 2 "share:LED_WS2812B-PLCC4_modif" H 9600 3200 20  0001 C CNN
F 3 "" H 9600 2750 50  0001 C CNN
F 4 "DIO-12503" H 9600 3131 60  0000 C CNN "Field4"
	1    9600 2750
	1    0    0    -1  
$EndComp
$Comp
L SparkFun-LED:WS2812B D11
U 1 1 5CF3AC63
P 3350 4000
F 0 "D11" H 3350 4560 45  0000 C CNN
F 1 "WS2812B" H 3350 4476 45  0000 C CNN
F 2 "share:LED_WS2812B-PLCC4_modif" H 3350 4450 20  0001 C CNN
F 3 "" H 3350 4000 50  0001 C CNN
F 4 "DIO-12503" H 3350 4381 60  0000 C CNN "Field4"
	1    3350 4000
	1    0    0    -1  
$EndComp
Wire Wire Line
	2650 3900 2650 4100
Wire Wire Line
	2650 4100 2800 4100
Wire Wire Line
	1650 4300 3900 4300
Wire Wire Line
	3900 4300 3900 4100
Wire Wire Line
	2650 3800 2650 3400
Wire Wire Line
	2650 3800 2800 3800
Text Notes 3950 3650 0    50   ~ 0
DOUT
$Comp
L SparkFun-LED:WS2812B D12
U 1 1 5CF3AC74
P 4950 4000
F 0 "D12" H 4950 4560 45  0000 C CNN
F 1 "WS2812B" H 4950 4476 45  0000 C CNN
F 2 "share:LED_WS2812B-PLCC4_modif" H 4950 4450 20  0001 C CNN
F 3 "" H 4950 4000 50  0001 C CNN
F 4 "DIO-12503" H 4950 4381 60  0000 C CNN "Field4"
	1    4950 4000
	1    0    0    -1  
$EndComp
$Comp
L SparkFun-LED:WS2812B D13
U 1 1 5CF3AC7B
P 6500 4000
F 0 "D13" H 6500 4560 45  0000 C CNN
F 1 "WS2812B" H 6500 4476 45  0000 C CNN
F 2 "share:LED_WS2812B-PLCC4_modif" H 6500 4450 20  0001 C CNN
F 3 "" H 6500 4000 50  0001 C CNN
F 4 "DIO-12503" H 6500 4381 60  0000 C CNN "Field4"
	1    6500 4000
	1    0    0    -1  
$EndComp
$Comp
L SparkFun-LED:WS2812B D14
U 1 1 5CF3AC82
P 8000 4000
F 0 "D14" H 8000 4560 45  0000 C CNN
F 1 "WS2812B" H 8000 4476 45  0000 C CNN
F 2 "share:LED_WS2812B-PLCC4_modif" H 8000 4450 20  0001 C CNN
F 3 "" H 8000 4000 50  0001 C CNN
F 4 "DIO-12503" H 8000 4381 60  0000 C CNN "Field4"
	1    8000 4000
	1    0    0    -1  
$EndComp
$Comp
L SparkFun-LED:WS2812B D15
U 1 1 5CF3AC89
P 9600 4000
F 0 "D15" H 9600 4560 45  0000 C CNN
F 1 "WS2812B" H 9600 4476 45  0000 C CNN
F 2 "share:LED_WS2812B-PLCC4_modif" H 9600 4450 20  0001 C CNN
F 3 "" H 9600 4000 50  0001 C CNN
F 4 "DIO-12503" H 9600 4381 60  0000 C CNN "Field4"
	1    9600 4000
	1    0    0    -1  
$EndComp
$Comp
L SparkFun-LED:WS2812B D16
U 1 1 5CF43268
P 3350 5150
F 0 "D16" H 3350 5710 45  0000 C CNN
F 1 "WS2812B" H 3350 5626 45  0000 C CNN
F 2 "share:LED_WS2812B-PLCC4_modif" H 3350 5600 20  0001 C CNN
F 3 "" H 3350 5150 50  0001 C CNN
F 4 "DIO-12503" H 3350 5531 60  0000 C CNN "Field4"
	1    3350 5150
	1    0    0    -1  
$EndComp
Wire Wire Line
	2650 5050 2650 5250
Wire Wire Line
	2650 5250 2800 5250
Wire Wire Line
	1650 5450 3900 5450
Wire Wire Line
	3900 5450 3900 5250
Wire Wire Line
	2650 4950 2650 4550
Wire Wire Line
	2650 4950 2800 4950
Text Notes 3950 4800 0    50   ~ 0
DOUT
$Comp
L SparkFun-LED:WS2812B D17
U 1 1 5CF43279
P 4950 5150
F 0 "D17" H 4950 5710 45  0000 C CNN
F 1 "WS2812B" H 4950 5626 45  0000 C CNN
F 2 "share:LED_WS2812B-PLCC4_modif" H 4950 5600 20  0001 C CNN
F 3 "" H 4950 5150 50  0001 C CNN
F 4 "DIO-12503" H 4950 5531 60  0000 C CNN "Field4"
	1    4950 5150
	1    0    0    -1  
$EndComp
$Comp
L SparkFun-LED:WS2812B D18
U 1 1 5CF43280
P 6500 5150
F 0 "D18" H 6500 5710 45  0000 C CNN
F 1 "WS2812B" H 6500 5626 45  0000 C CNN
F 2 "share:LED_WS2812B-PLCC4_modif" H 6500 5600 20  0001 C CNN
F 3 "" H 6500 5150 50  0001 C CNN
F 4 "DIO-12503" H 6500 5531 60  0000 C CNN "Field4"
	1    6500 5150
	1    0    0    -1  
$EndComp
$Comp
L SparkFun-LED:WS2812B D19
U 1 1 5CF43287
P 8000 5150
F 0 "D19" H 8000 5710 45  0000 C CNN
F 1 "WS2812B" H 8000 5626 45  0000 C CNN
F 2 "share:LED_WS2812B-PLCC4_modif" H 8000 5600 20  0001 C CNN
F 3 "" H 8000 5150 50  0001 C CNN
F 4 "DIO-12503" H 8000 5531 60  0000 C CNN "Field4"
	1    8000 5150
	1    0    0    -1  
$EndComp
$Comp
L SparkFun-LED:WS2812B D20
U 1 1 5CF4328E
P 9600 5150
F 0 "D20" H 9600 5710 45  0000 C CNN
F 1 "WS2812B" H 9600 5626 45  0000 C CNN
F 2 "share:LED_WS2812B-PLCC4_modif" H 9600 5600 20  0001 C CNN
F 3 "" H 9600 5150 50  0001 C CNN
F 4 "DIO-12503" H 9600 5531 60  0000 C CNN "Field4"
	1    9600 5150
	1    0    0    -1  
$EndComp
Wire Wire Line
	2650 900  4400 900 
Wire Wire Line
	9050 900  9050 1300
Wire Wire Line
	7450 1300 7450 900 
Connection ~ 7450 900 
Wire Wire Line
	7450 900  9050 900 
Wire Wire Line
	5950 1300 5950 900 
Connection ~ 5950 900 
Wire Wire Line
	5950 900  7450 900 
Wire Wire Line
	4400 1300 4400 900 
Connection ~ 4400 900 
Wire Wire Line
	4400 900  5950 900 
Wire Wire Line
	2650 2150 4400 2150
Wire Wire Line
	9050 2150 9050 2550
Wire Wire Line
	7450 2550 7450 2150
Connection ~ 7450 2150
Wire Wire Line
	7450 2150 9050 2150
Wire Wire Line
	5950 2550 5950 2150
Connection ~ 5950 2150
Wire Wire Line
	5950 2150 7450 2150
Wire Wire Line
	4400 2500 4400 2150
Connection ~ 4400 2150
Wire Wire Line
	4400 2150 5950 2150
Wire Wire Line
	2650 3400 4400 3400
Wire Wire Line
	9050 3400 9050 3800
Wire Wire Line
	7450 3800 7450 3400
Connection ~ 7450 3400
Wire Wire Line
	7450 3400 9050 3400
Wire Wire Line
	5950 3800 5950 3400
Connection ~ 5950 3400
Wire Wire Line
	5950 3400 7450 3400
Wire Wire Line
	4400 3800 4400 3400
Connection ~ 4400 3400
Wire Wire Line
	4400 3400 5950 3400
Wire Wire Line
	2650 4550 4400 4550
Wire Wire Line
	9050 4550 9050 4950
Wire Wire Line
	7450 4950 7450 4550
Connection ~ 7450 4550
Wire Wire Line
	7450 4550 9050 4550
Wire Wire Line
	5950 4950 5950 4550
Connection ~ 5950 4550
Wire Wire Line
	5950 4550 7450 4550
Wire Wire Line
	4400 4950 4400 4550
Connection ~ 4400 4550
Wire Wire Line
	4400 4550 5950 4550
Wire Wire Line
	3900 1800 5500 1800
Wire Wire Line
	10150 1800 10150 1600
Connection ~ 3900 1800
Wire Wire Line
	8550 1600 8550 1800
Connection ~ 8550 1800
Wire Wire Line
	8550 1800 10150 1800
Wire Wire Line
	7050 1600 7050 1800
Connection ~ 7050 1800
Wire Wire Line
	7050 1800 8550 1800
Wire Wire Line
	5500 1600 5500 1800
Connection ~ 5500 1800
Wire Wire Line
	5500 1800 7050 1800
Wire Wire Line
	1650 1800 1650 3050
Connection ~ 1650 1800
Wire Wire Line
	1650 3050 1650 4300
Connection ~ 1650 3050
Wire Wire Line
	1650 4300 1650 5450
Connection ~ 1650 4300
Wire Wire Line
	3900 3050 5500 3050
Wire Wire Line
	10200 3050 10200 2850
Wire Wire Line
	10200 2850 10150 2850
Connection ~ 3900 3050
Wire Wire Line
	8550 2850 8550 3050
Connection ~ 8550 3050
Wire Wire Line
	8550 3050 10200 3050
Wire Wire Line
	7050 2850 7050 3050
Connection ~ 7050 3050
Wire Wire Line
	7050 3050 8550 3050
Wire Wire Line
	5500 2850 5500 3050
Connection ~ 5500 3050
Wire Wire Line
	5500 3050 7050 3050
Wire Wire Line
	3900 4300 5500 4300
Wire Wire Line
	10200 4300 10200 4100
Wire Wire Line
	10200 4100 10150 4100
Connection ~ 3900 4300
Wire Wire Line
	8550 4100 8550 4300
Connection ~ 8550 4300
Wire Wire Line
	8550 4300 10200 4300
Wire Wire Line
	7050 4100 7050 4300
Connection ~ 7050 4300
Wire Wire Line
	7050 4300 8550 4300
Wire Wire Line
	5500 4100 5500 4300
Connection ~ 5500 4300
Wire Wire Line
	5500 4300 7050 4300
Wire Wire Line
	3900 5450 5500 5450
Wire Wire Line
	10200 5450 10200 5250
Wire Wire Line
	10200 5250 10150 5250
Connection ~ 3900 5450
Wire Wire Line
	8550 5250 8550 5450
Connection ~ 8550 5450
Wire Wire Line
	8550 5450 10200 5450
Wire Wire Line
	7050 5250 7050 5450
Connection ~ 7050 5450
Wire Wire Line
	7050 5450 8550 5450
Wire Wire Line
	5500 5250 5500 5450
Connection ~ 5500 5450
Wire Wire Line
	5500 5450 7050 5450
Wire Wire Line
	3900 1300 4150 1300
Wire Wire Line
	4150 1300 4150 1600
Wire Wire Line
	4150 1600 4400 1600
Wire Wire Line
	5500 1300 5700 1300
Wire Wire Line
	5700 1300 5700 1600
Wire Wire Line
	5700 1600 5950 1600
Wire Wire Line
	7050 1300 7250 1300
Wire Wire Line
	7250 1300 7250 1600
Wire Wire Line
	7250 1600 7450 1600
Wire Wire Line
	8550 1300 8750 1300
Wire Wire Line
	8750 1300 8750 1600
Wire Wire Line
	8750 1600 9050 1600
Wire Wire Line
	10150 1300 10550 1300
Wire Wire Line
	10550 1300 10550 1950
Wire Wire Line
	10550 1950 2450 1950
Wire Wire Line
	2450 1950 2450 2850
Wire Wire Line
	2450 2850 2800 2850
Wire Wire Line
	3900 2550 4150 2550
Wire Wire Line
	4150 2550 4150 2850
Wire Wire Line
	4150 2850 4400 2850
Wire Wire Line
	5500 2550 5700 2550
Wire Wire Line
	5700 2550 5700 2850
Wire Wire Line
	5700 2850 5950 2850
Wire Wire Line
	7050 2550 7250 2550
Wire Wire Line
	7250 2550 7250 2850
Wire Wire Line
	7250 2850 7450 2850
Wire Wire Line
	8550 2550 8750 2550
Wire Wire Line
	8750 2550 8750 2850
Wire Wire Line
	8750 2850 9050 2850
Wire Wire Line
	10150 2550 10550 2550
Wire Wire Line
	10550 2550 10550 3200
Wire Wire Line
	10550 3200 2450 3200
Wire Wire Line
	2450 3200 2450 4100
Wire Wire Line
	2450 4100 2650 4100
Connection ~ 2650 4100
Wire Wire Line
	3900 3800 4150 3800
Wire Wire Line
	4150 3800 4150 4100
Wire Wire Line
	4150 4100 4400 4100
Wire Wire Line
	5500 3800 5750 3800
Wire Wire Line
	5750 3800 5750 4100
Wire Wire Line
	5750 4100 5950 4100
Wire Wire Line
	7050 3800 7250 3800
Wire Wire Line
	7250 3800 7250 4100
Wire Wire Line
	7250 4100 7450 4100
Wire Wire Line
	8550 3800 8800 3800
Wire Wire Line
	8800 3800 8800 4100
Wire Wire Line
	8800 4100 9050 4100
Wire Wire Line
	10150 3800 10600 3800
Wire Wire Line
	10600 3800 10600 4400
Wire Wire Line
	10600 4400 2450 4400
Wire Wire Line
	2450 4400 2450 5250
Wire Wire Line
	2450 5250 2650 5250
Connection ~ 2650 5250
Wire Wire Line
	3900 4950 4100 4950
Wire Wire Line
	4100 4950 4100 5250
Wire Wire Line
	4100 5250 4400 5250
Wire Wire Line
	5500 4950 5700 4950
Wire Wire Line
	5700 4950 5700 5250
Wire Wire Line
	5700 5250 5950 5250
Wire Wire Line
	7050 4950 7250 4950
Wire Wire Line
	7250 4950 7250 5250
Wire Wire Line
	7250 5250 7450 5250
Wire Wire Line
	8550 4950 8800 4950
Wire Wire Line
	8800 4950 8800 5250
Wire Wire Line
	8800 5250 9050 5250
Wire Wire Line
	10300 4950 10300 6050
Wire Wire Line
	10300 6050 10550 6050
Wire Wire Line
	10550 6150 10200 6150
Wire Wire Line
	10200 6150 10200 5450
Connection ~ 10200 5450
Wire Wire Line
	10150 4950 10300 4950
Wire Wire Line
	9050 4550 10500 4550
Wire Wire Line
	10500 4550 10500 5850
Wire Wire Line
	10500 5850 10550 5850
Connection ~ 9050 4550
$EndSCHEMATC
