EESchema Schematic File Version 4
EELAYER 29 0
EELAYER END
$Descr A4 11693 8268
encoding utf-8
Sheet 1 1
Title ""
Date ""
Rev ""
Comp ""
Comment1 ""
Comment2 ""
Comment3 ""
Comment4 ""
$EndDescr
$Comp
L arduino_nano:Arduino_Nano A1
U 1 1 5C96E81B
P 6000 2750
F 0 "A1" H 6000 2750 60  0000 C CNN
F 1 "Arduino_Nano" H 6000 2900 60  0000 C CNN
F 2 "Modules:Arduino_Nano" H 6200 4000 60  0000 C CNN
F 3 "" H 6000 2750 60  0000 C CNN
	1    6000 2750
	-1   0    0    1   
$EndComp
$Comp
L openLEDrace1-rescue:Jack-DC J1
U 1 1 5C96EE80
P 1800 5350
F 0 "J1" H 1800 5560 50  0000 C CNN
F 1 "Jack-DC" H 1800 5175 50  0000 C CNN
F 2 "Connectors:BARREL_JACK" H 1850 5310 50  0001 C CNN
F 3 "" H 1850 5310 50  0001 C CNN
	1    1800 5350
	1    0    0    -1  
$EndComp
$Comp
L device:CP C6
U 1 1 5C96F4B8
P 7900 4400
F 0 "C6" H 7925 4500 50  0000 L CNN
F 1 "CP" H 7925 4300 50  0000 L CNN
F 2 "Capacitors_THT:CP_Radial_D8.0mm_P5.00mm" H 7938 4250 50  0001 C CNN
F 3 "" H 7900 4400 50  0001 C CNN
	1    7900 4400
	1    0    0    -1  
$EndComp
$Comp
L openLEDrace1-rescue:Conn_01x02_Female J8
U 1 1 5C96F73E
P 8500 3350
F 0 "J8" H 8500 3450 50  0000 C CNN
F 1 "SPEAKER" H 8700 3300 50  0000 C CNN
F 2 "Socket_Strips:Socket_Strip_Straight_1x02_Pitch2.54mm" H 8500 3350 50  0001 C CNN
F 3 "" H 8500 3350 50  0001 C CNN
	1    8500 3350
	1    0    0    -1  
$EndComp
$Comp
L openLEDrace1-rescue:Conn_01x04 J9
U 1 1 5C96F7B4
P 8750 4050
F 0 "J9" H 8750 4250 50  0000 C CNN
F 1 "WS2813" H 8750 3750 50  0000 C CNN
F 2 "Pin_Headers:Pin_Header_Angled_1x04_Pitch2.54mm" H 8750 4050 50  0001 C CNN
F 3 "" H 8750 4050 50  0001 C CNN
	1    8750 4050
	1    0    0    -1  
$EndComp
$Comp
L openLEDrace1-rescue:Conn_01x03 J10
U 1 1 5C96F7E9
P 8750 4700
F 0 "J10" H 8750 4900 50  0000 C CNN
F 1 "WS2812" H 8750 4500 50  0000 C CNN
F 2 "Pin_Headers:Pin_Header_Angled_1x03_Pitch2.54mm" H 8750 4700 50  0001 C CNN
F 3 "" H 8750 4700 50  0001 C CNN
	1    8750 4700
	1    0    0    -1  
$EndComp
Wire Wire Line
	5300 3500 5200 3500
Wire Wire Line
	5200 3500 5200 4150
Wire Wire Line
	5200 4150 7200 4150
Wire Wire Line
	7200 4150 7200 2800
Wire Wire Line
	7200 2800 8300 2800
Wire Wire Line
	8300 3100 8300 3350
Wire Wire Line
	7900 3950 8550 3950
Wire Wire Line
	7900 3950 7900 4200
Wire Wire Line
	8100 4600 8550 4600
Wire Wire Line
	8100 4200 8100 4600
Wire Wire Line
	7400 4200 7900 4200
Connection ~ 7900 4200
Wire Wire Line
	4850 4700 8300 4700
Wire Wire Line
	4850 3600 5300 3600
Wire Wire Line
	8550 4250 8450 4250
Wire Wire Line
	8450 4150 8450 4250
Wire Wire Line
	7900 4800 8450 4800
Connection ~ 8450 4800
$Comp
L power:GNDREF #PWR01
U 1 1 5C9703CB
P 8450 5100
F 0 "#PWR01" H 8450 4850 50  0001 C CNN
F 1 "GNDREF" H 8450 4950 50  0000 C CNN
F 2 "" H 8450 5100 50  0001 C CNN
F 3 "" H 8450 5100 50  0001 C CNN
	1    8450 5100
	1    0    0    -1  
$EndComp
Wire Wire Line
	8550 4150 8450 4150
Connection ~ 8450 4250
Wire Wire Line
	8550 4050 8300 4050
Wire Wire Line
	8300 4050 8300 4700
Connection ~ 8300 4700
Wire Wire Line
	7900 4550 7900 4800
$Comp
L openLEDrace1-rescue:AP1117-50 U2
U 1 1 5C970B5D
P 6150 5250
F 0 "U2" H 6000 5375 50  0000 C CNN
F 1 "AP1117-50" H 6150 5375 50  0000 L CNN
F 2 "TO_SOT_Packages_SMD:SOT-223-3_TabPin2" H 6150 5450 50  0001 C CNN
F 3 "" H 6250 5000 50  0001 C CNN
	1    6150 5250
	1    0    0    -1  
$EndComp
Wire Wire Line
	6450 5250 6900 5250
Wire Wire Line
	7400 5250 7400 4200
Wire Wire Line
	2100 5250 3750 5250
$Comp
L power:GNDREF #PWR02
U 1 1 5C970C00
P 6150 5700
F 0 "#PWR02" H 6150 5450 50  0001 C CNN
F 1 "GNDREF" H 6150 5550 50  0000 C CNN
F 2 "" H 6150 5700 50  0001 C CNN
F 3 "" H 6150 5700 50  0001 C CNN
	1    6150 5700
	1    0    0    -1  
$EndComp
Wire Wire Line
	6150 5550 6150 5700
Wire Wire Line
	6900 3400 6900 5250
Connection ~ 6900 5250
$Comp
L power:GNDREF #PWR03
U 1 1 5C9726AB
P 2150 5700
F 0 "#PWR03" H 2150 5450 50  0001 C CNN
F 1 "GNDREF" H 2150 5550 50  0000 C CNN
F 2 "" H 2150 5700 50  0001 C CNN
F 3 "" H 2150 5700 50  0001 C CNN
	1    2150 5700
	1    0    0    -1  
$EndComp
Wire Wire Line
	2100 5450 2150 5450
Wire Wire Line
	2150 5450 2150 5700
Wire Wire Line
	6650 3400 6900 3400
Wire Wire Line
	6650 1750 6650 1800
$Comp
L power:GNDREF #PWR04
U 1 1 5C972E2F
P 6700 2000
F 0 "#PWR04" H 6700 1750 50  0001 C CNN
F 1 "GNDREF" H 6700 1850 50  0000 C CNN
F 2 "" H 6700 2000 50  0001 C CNN
F 3 "" H 6700 2000 50  0001 C CNN
	1    6700 2000
	1    0    0    -1  
$EndComp
Wire Wire Line
	6700 2000 6700 1800
Wire Wire Line
	6700 1800 6650 1800
Connection ~ 6650 1800
$Comp
L power:GNDREF #PWR05
U 1 1 5C973404
P 8300 3600
F 0 "#PWR05" H 8300 3350 50  0001 C CNN
F 1 "GNDREF" H 8300 3450 50  0000 C CNN
F 2 "" H 8300 3600 50  0001 C CNN
F 3 "" H 8300 3600 50  0001 C CNN
	1    8300 3600
	1    0    0    -1  
$EndComp
Wire Wire Line
	8300 3600 8300 3450
$Comp
L device:CP C4
U 1 1 5C9FDEED
P 5650 5500
F 0 "C4" H 5675 5600 50  0000 L CNN
F 1 "CP" H 5675 5400 50  0000 L CNN
F 2 "Capacitors_THT:CP_Radial_D5.0mm_P2.50mm" H 5688 5350 50  0001 C CNN
F 3 "" H 5650 5500 50  0001 C CNN
	1    5650 5500
	1    0    0    -1  
$EndComp
$Comp
L device:CP C5
U 1 1 5C9FDFC7
P 6900 5500
F 0 "C5" H 6925 5600 50  0000 L CNN
F 1 "CP" H 6925 5400 50  0000 L CNN
F 2 "Capacitors_THT:CP_Radial_D5.0mm_P2.50mm" H 6938 5350 50  0001 C CNN
F 3 "" H 6900 5500 50  0001 C CNN
	1    6900 5500
	1    0    0    -1  
$EndComp
Wire Wire Line
	5650 5250 5650 5350
Connection ~ 5650 5250
$Comp
L power:GNDREF #PWR06
U 1 1 5C9FE1E9
P 6900 5750
F 0 "#PWR06" H 6900 5500 50  0001 C CNN
F 1 "GNDREF" H 6900 5600 50  0000 C CNN
F 2 "" H 6900 5750 50  0001 C CNN
F 3 "" H 6900 5750 50  0001 C CNN
	1    6900 5750
	1    0    0    -1  
$EndComp
$Comp
L power:GNDREF #PWR07
U 1 1 5C9FE219
P 5650 5800
F 0 "#PWR07" H 5650 5550 50  0001 C CNN
F 1 "GNDREF" H 5650 5650 50  0000 C CNN
F 2 "" H 5650 5800 50  0001 C CNN
F 3 "" H 5650 5800 50  0001 C CNN
	1    5650 5800
	1    0    0    -1  
$EndComp
Wire Wire Line
	5650 5650 5650 5800
Wire Wire Line
	6900 5650 6900 5750
$Comp
L openLEDrace1-rescue:Audio-Jack-3_2Switches J3
U 1 1 5CA09FC2
P 2650 1250
F 0 "J3" H 2650 1540 50  0000 C CNN
F 1 "Audio-Jack-3_2Switches" H 2500 1050 50  0000 L CNN
F 2 "w_conn_av:Tayda_3.5mm_stereo_TRS_jack_A-853" H 2900 1350 50  0001 C CNN
F 3 "" H 2900 1350 50  0001 C CNN
	1    2650 1250
	1    0    0    -1  
$EndComp
$Comp
L openLEDrace1-rescue:Audio-Jack-3_2Switches J4
U 1 1 5CA0AADA
P 2650 1900
F 0 "J4" H 2650 2190 50  0000 C CNN
F 1 "Audio-Jack-3_2Switches" H 2300 1650 50  0000 L CNN
F 2 "w_conn_av:Tayda_3.5mm_stereo_TRS_jack_A-853" H 2900 2000 50  0001 C CNN
F 3 "" H 2900 2000 50  0001 C CNN
	1    2650 1900
	1    0    0    -1  
$EndComp
$Comp
L openLEDrace1-rescue:Audio-Jack-3_2Switches J5
U 1 1 5CA0AB3E
P 2650 2600
F 0 "J5" H 2650 2890 50  0000 C CNN
F 1 "Audio-Jack-3_2Switches" H 2250 2300 50  0000 L CNN
F 2 "w_conn_av:Tayda_3.5mm_stereo_TRS_jack_A-853" H 2900 2700 50  0001 C CNN
F 3 "" H 2900 2700 50  0001 C CNN
	1    2650 2600
	1    0    0    -1  
$EndComp
Wire Wire Line
	2850 1800 4850 1800
Wire Wire Line
	4000 2500 2850 2500
Wire Wire Line
	2450 1450 2450 1500
Wire Wire Line
	2450 1500 3300 1500
Wire Wire Line
	3300 1500 3300 2100
Wire Wire Line
	3300 2100 2450 2100
Wire Wire Line
	3300 2850 2450 2850
Wire Wire Line
	2450 2850 2450 2800
Connection ~ 3300 2100
Wire Wire Line
	2850 1900 3900 1900
Wire Wire Line
	3900 1900 3900 2300
Wire Wire Line
	3900 2300 5300 2300
Wire Wire Line
	2850 2600 4800 2600
Wire Wire Line
	4800 2600 4800 2200
Wire Wire Line
	4800 2200 5300 2200
$Comp
L power:GNDREF #PWR08
U 1 1 5CA0CBCF
P 3300 3000
F 0 "#PWR08" H 3300 2750 50  0001 C CNN
F 1 "GNDREF" H 3300 2850 50  0000 C CNN
F 2 "" H 3300 3000 50  0001 C CNN
F 3 "" H 3300 3000 50  0001 C CNN
	1    3300 3000
	1    0    0    -1  
$EndComp
Connection ~ 3300 2850
Wire Wire Line
	7050 3300 6650 3300
$Comp
L device:R R2
U 1 1 5CA0D2C7
P 4250 4450
F 0 "R2" V 4330 4450 50  0000 C CNN
F 1 "2K" V 4250 4450 50  0000 C CNN
F 2 "Resistors_THT:R_Axial_DIN0309_L9.0mm_D3.2mm_P12.70mm_Horizontal" V 4180 4450 50  0001 C CNN
F 3 "" H 4250 4450 50  0001 C CNN
	1    4250 4450
	1    0    0    -1  
$EndComp
$Comp
L device:R R1
U 1 1 5CA0D33A
P 4250 4050
F 0 "R1" V 4330 4050 50  0000 C CNN
F 1 "1K" V 4250 4050 50  0000 C CNN
F 2 "Resistors_THT:R_Axial_DIN0309_L9.0mm_D3.2mm_P12.70mm_Horizontal" V 4180 4050 50  0001 C CNN
F 3 "" H 4250 4050 50  0001 C CNN
	1    4250 4050
	1    0    0    -1  
$EndComp
Wire Wire Line
	5300 3800 4250 3800
Wire Wire Line
	4250 3800 4250 3900
Wire Wire Line
	4250 4200 4250 4250
$Comp
L power:GNDREF #PWR09
U 1 1 5CA0D59A
P 4250 4750
F 0 "#PWR09" H 4250 4500 50  0001 C CNN
F 1 "GNDREF" H 4250 4600 50  0000 C CNN
F 2 "" H 4250 4750 50  0001 C CNN
F 3 "" H 4250 4750 50  0001 C CNN
	1    4250 4750
	1    0    0    -1  
$EndComp
Wire Wire Line
	4250 4600 4250 4650
$Comp
L openLEDrace1-rescue:Conn_01x04 J6
U 1 1 5CA0D870
P 3200 4250
F 0 "J6" H 3200 4450 50  0000 C CNN
F 1 "HC-05" H 3200 3950 50  0000 C CNN
F 2 "Socket_Strips:Socket_Strip_Straight_1x04_Pitch2.54mm" H 3200 4250 50  0001 C CNN
F 3 "" H 3200 4250 50  0001 C CNN
	1    3200 4250
	-1   0    0    1   
$EndComp
Wire Wire Line
	4250 4250 3700 4250
Wire Wire Line
	3700 4250 3700 4050
Wire Wire Line
	3700 4050 3400 4050
Connection ~ 4250 4250
Wire Wire Line
	3400 4250 3600 4250
Wire Wire Line
	3600 4250 3600 4650
Wire Wire Line
	2050 4650 3600 4650
Connection ~ 4250 4650
Wire Wire Line
	3400 4150 3600 4150
Wire Wire Line
	3600 4150 3600 3700
Wire Wire Line
	7050 5000 3450 5000
Wire Wire Line
	3450 5000 3450 4350
Wire Wire Line
	3450 4350 3400 4350
$Comp
L openLEDrace1-rescue:Conn_02x04_Odd_Even J2
U 1 1 5CA0DD00
P 2350 4150
F 0 "J2" H 2400 4350 50  0000 C CNN
F 1 "ESP 8266" H 2400 3850 50  0000 C CNN
F 2 "Socket_Strips:Socket_Strip_Straight_2x04_Pitch2.54mm" H 2350 4150 50  0001 C CNN
F 3 "" H 2350 4150 50  0001 C CNN
	1    2350 4150
	1    0    0    -1  
$EndComp
$Comp
L power:GNDREF #PWR010
U 1 1 5CA0DF51
P 1850 4100
F 0 "#PWR010" H 1850 3850 50  0001 C CNN
F 1 "GNDREF" H 1850 3950 50  0000 C CNN
F 2 "" H 1850 4100 50  0001 C CNN
F 3 "" H 1850 4100 50  0001 C CNN
	1    1850 4100
	1    0    0    -1  
$EndComp
Wire Wire Line
	2150 4050 1850 4050
Wire Wire Line
	1850 4050 1850 4100
Wire Wire Line
	2750 3700 2750 4050
Wire Wire Line
	2750 4050 2650 4050
Connection ~ 3600 3700
Wire Wire Line
	2750 3700 3600 3700
Wire Wire Line
	2150 4350 2050 4350
Wire Wire Line
	2050 4350 2050 4650
Connection ~ 3600 4650
Wire Wire Line
	2650 4150 2750 4150
Wire Wire Line
	2750 4150 2750 4250
Wire Wire Line
	2750 4350 2650 4350
Wire Wire Line
	2750 4250 2950 4250
Wire Wire Line
	2950 4250 2950 4800
Connection ~ 2750 4250
Text Notes 7150 6900 0    157  ~ 0
Open LED Race Shield V 0.1
Wire Wire Line
	2850 1250 4400 1250
Wire Wire Line
	4400 1250 4400 2400
Wire Wire Line
	4400 2400 5300 2400
Wire Wire Line
	4950 1150 4950 1900
Wire Wire Line
	4950 1900 5300 1900
Wire Wire Line
	4850 1800 4850 2000
Wire Wire Line
	4850 2000 5300 2000
Wire Wire Line
	4000 2500 4000 2100
Wire Wire Line
	4000 2100 5300 2100
$Comp
L openLEDrace1-rescue:AP1117-50 U1
U 1 1 5CA1025F
P 4250 5700
F 0 "U1" H 4100 5825 50  0000 C CNN
F 1 "AP1117-33" H 4250 5825 50  0000 L CNN
F 2 "TO_SOT_Packages_SMD:SOT-223-3_TabPin2" H 4250 5900 50  0001 C CNN
F 3 "" H 4350 5450 50  0001 C CNN
	1    4250 5700
	1    0    0    -1  
$EndComp
$Comp
L power:GNDREF #PWR011
U 1 1 5CA10267
P 4250 6150
F 0 "#PWR011" H 4250 5900 50  0001 C CNN
F 1 "GNDREF" H 4250 6000 50  0000 C CNN
F 2 "" H 4250 6150 50  0001 C CNN
F 3 "" H 4250 6150 50  0001 C CNN
	1    4250 6150
	1    0    0    -1  
$EndComp
Wire Wire Line
	4250 6000 4250 6150
Connection ~ 5000 5700
$Comp
L device:CP C2
U 1 1 5CA10270
P 3750 5950
F 0 "C2" H 3775 6050 50  0000 L CNN
F 1 "CP" H 3775 5850 50  0000 L CNN
F 2 "Capacitors_THT:CP_Radial_D5.0mm_P2.50mm" H 3788 5800 50  0001 C CNN
F 3 "" H 3750 5950 50  0001 C CNN
	1    3750 5950
	1    0    0    -1  
$EndComp
$Comp
L device:CP C3
U 1 1 5CA10276
P 5000 5950
F 0 "C3" H 5025 6050 50  0000 L CNN
F 1 "CP" H 5025 5850 50  0000 L CNN
F 2 "Capacitors_THT:CP_Radial_D5.0mm_P2.50mm" H 5038 5800 50  0001 C CNN
F 3 "" H 5000 5950 50  0001 C CNN
	1    5000 5950
	1    0    0    -1  
$EndComp
Wire Wire Line
	3750 5250 3750 5700
Connection ~ 3750 5700
$Comp
L power:GNDREF #PWR012
U 1 1 5CA1027E
P 5000 6200
F 0 "#PWR012" H 5000 5950 50  0001 C CNN
F 1 "GNDREF" H 5000 6050 50  0000 C CNN
F 2 "" H 5000 6200 50  0001 C CNN
F 3 "" H 5000 6200 50  0001 C CNN
	1    5000 6200
	1    0    0    -1  
$EndComp
$Comp
L power:GNDREF #PWR013
U 1 1 5CA10284
P 3750 6250
F 0 "#PWR013" H 3750 6000 50  0001 C CNN
F 1 "GNDREF" H 3750 6100 50  0000 C CNN
F 2 "" H 3750 6250 50  0001 C CNN
F 3 "" H 3750 6250 50  0001 C CNN
	1    3750 6250
	1    0    0    -1  
$EndComp
Wire Wire Line
	3750 6100 3750 6250
Wire Wire Line
	5000 6100 5000 6200
Wire Wire Line
	4550 5700 5000 5700
Wire Wire Line
	3950 5700 3750 5700
Connection ~ 3750 5250
Wire Wire Line
	7050 5000 7050 3300
$Comp
L openLEDrace1-rescue:Conn_01x03 J7
U 1 1 5CA10E3B
P 5350 4400
F 0 "J7" H 5350 4600 50  0000 C CNN
F 1 "pw select" V 5450 4350 50  0000 C CNN
F 2 "Pin_Headers:Pin_Header_Straight_1x03_Pitch2.54mm" H 5350 4400 50  0001 C CNN
F 3 "" H 5350 4400 50  0001 C CNN
	1    5350 4400
	0    -1   -1   0   
$EndComp
Wire Wire Line
	5350 4600 5350 5100
Wire Wire Line
	5350 5100 2950 5100
Wire Wire Line
	5000 5700 5000 5800
Wire Wire Line
	5250 5700 5250 4600
Wire Wire Line
	5450 4600 6800 4600
Wire Wire Line
	6800 4600 6800 3200
Wire Wire Line
	6800 3200 6650 3200
Text Notes 7150 7100 0    60   ~ 0
(CC- BY-SA) 2019  Gerardo A. Barbarov Rostan - Singular Devices Maker Studio
$Comp
L device:CP C1
U 1 1 5CA123FF
P 2650 4800
F 0 "C1" H 2675 4900 50  0000 L CNN
F 1 "CP" H 2675 4700 50  0000 L CNN
F 2 "Capacitors_THT:CP_Radial_D5.0mm_P2.50mm" H 2688 4650 50  0001 C CNN
F 3 "" H 2650 4800 50  0001 C CNN
	1    2650 4800
	0    1    1    0   
$EndComp
Wire Wire Line
	2800 4800 2950 4800
Connection ~ 2950 4800
$Comp
L power:GNDREF #PWR014
U 1 1 5CA12643
P 2400 4900
F 0 "#PWR014" H 2400 4650 50  0001 C CNN
F 1 "GNDREF" H 2400 4750 50  0000 C CNN
F 2 "" H 2400 4900 50  0001 C CNN
F 3 "" H 2400 4900 50  0001 C CNN
	1    2400 4900
	1    0    0    -1  
$EndComp
Wire Wire Line
	2400 4900 2400 4800
Wire Wire Line
	2400 4800 2500 4800
Wire Wire Line
	2850 1150 4950 1150
$Comp
L device:C C7
U 1 1 5CA15DD9
P 8300 2950
F 0 "C7" H 8325 3050 50  0000 L CNN
F 1 "1uF" H 8325 2850 50  0000 L CNN
F 2 "Capacitors_THT:C_Disc_D6.0mm_W2.5mm_P5.00mm" H 8338 2800 50  0001 C CNN
F 3 "" H 8300 2950 50  0001 C CNN
	1    8300 2950
	1    0    0    -1  
$EndComp
$Comp
L device:R R3
U 1 1 5CA16F5B
P 4850 4300
F 0 "R3" V 4930 4300 50  0000 C CNN
F 1 "500" V 4850 4300 50  0000 C CNN
F 2 "Resistors_THT:R_Axial_DIN0309_L9.0mm_D3.2mm_P12.70mm_Horizontal" V 4780 4300 50  0001 C CNN
F 3 "" H 4850 4300 50  0001 C CNN
	1    4850 4300
	1    0    0    -1  
$EndComp
Wire Wire Line
	4850 4150 4850 3600
Wire Wire Line
	4850 4450 4850 4700
Wire Wire Line
	7900 4200 7900 4250
Wire Wire Line
	7900 4200 8100 4200
Wire Wire Line
	8450 4800 8450 5100
Wire Wire Line
	8450 4800 8550 4800
Wire Wire Line
	8450 4250 8450 4800
Wire Wire Line
	8300 4700 8550 4700
Wire Wire Line
	6900 5250 7400 5250
Wire Wire Line
	6900 5250 6900 5350
Wire Wire Line
	6650 1800 6650 1850
Wire Wire Line
	5650 5250 5850 5250
Wire Wire Line
	3300 2100 3300 2850
Wire Wire Line
	3300 2850 3300 3000
Wire Wire Line
	4250 4250 4250 4300
Wire Wire Line
	4250 4650 4250 4750
Wire Wire Line
	3600 3700 5300 3700
Wire Wire Line
	3600 4650 4250 4650
Wire Wire Line
	2750 4250 2750 4350
Wire Wire Line
	5000 5700 5250 5700
Wire Wire Line
	3750 5700 3750 5800
Wire Wire Line
	3750 5250 5650 5250
Wire Wire Line
	2950 4800 2950 5100
$EndSCHEMATC
