(export (version D)
  (design
    (source D:\DIGIXING\proyectos\modelos_singular_toys\pcbkicad\openLEDrace1\openLEDrace1.sch)
    (date "20/04/2019 19:15:21")
    (tool "Eeschema 4.0.7")
    (sheet (number 1) (name /) (tstamps /)
      (title_block
        (title)
        (company)
        (rev)
        (date)
        (source openLEDrace1.sch)
        (comment (number 1) (value ""))
        (comment (number 2) (value ""))
        (comment (number 3) (value ""))
        (comment (number 4) (value "")))))
  (components
    (comp (ref A1)
      (value Arduino_Nano)
      (footprint Modules:Arduino_Nano)
      (libsource (lib arduino_nano) (part Arduino_Nano))
      (sheetpath (names /) (tstamps /))
      (tstamp 5C96E81B))
    (comp (ref J1)
      (value Jack-DC)
      (footprint Connectors:BARREL_JACK)
      (libsource (lib conn) (part Jack-DC))
      (sheetpath (names /) (tstamps /))
      (tstamp 5C96EE80))
    (comp (ref C6)
      (value CP)
      (footprint Capacitors_THT:CP_Radial_D8.0mm_P5.00mm)
      (libsource (lib device) (part CP))
      (sheetpath (names /) (tstamps /))
      (tstamp 5C96F4B8))
    (comp (ref J8)
      (value SPEAKER)
      (footprint Socket_Strips:Socket_Strip_Straight_1x02_Pitch2.54mm)
      (libsource (lib conn) (part Conn_01x02_Female))
      (sheetpath (names /) (tstamps /))
      (tstamp 5C96F73E))
    (comp (ref J9)
      (value WS2813)
      (footprint Pin_Headers:Pin_Header_Angled_1x04_Pitch2.54mm)
      (libsource (lib conn) (part Conn_01x04))
      (sheetpath (names /) (tstamps /))
      (tstamp 5C96F7B4))
    (comp (ref J10)
      (value WS2812)
      (footprint Pin_Headers:Pin_Header_Angled_1x03_Pitch2.54mm)
      (libsource (lib conn) (part Conn_01x03))
      (sheetpath (names /) (tstamps /))
      (tstamp 5C96F7E9))
    (comp (ref U2)
      (value AP1117-50)
      (footprint TO_SOT_Packages_SMD:SOT-223-3_TabPin2)
      (libsource (lib regul) (part AP1117-50))
      (sheetpath (names /) (tstamps /))
      (tstamp 5C970B5D))
    (comp (ref C4)
      (value CP)
      (footprint Capacitors_THT:CP_Radial_D5.0mm_P2.50mm)
      (libsource (lib device) (part CP))
      (sheetpath (names /) (tstamps /))
      (tstamp 5C9FDEED))
    (comp (ref C5)
      (value CP)
      (footprint Capacitors_THT:CP_Radial_D5.0mm_P2.50mm)
      (libsource (lib device) (part CP))
      (sheetpath (names /) (tstamps /))
      (tstamp 5C9FDFC7))
    (comp (ref J3)
      (value Audio-Jack-3_2Switches)
      (footprint w_conn_av:Tayda_3.5mm_stereo_TRS_jack_A-853)
      (libsource (lib conn) (part Audio-Jack-3_2Switches))
      (sheetpath (names /) (tstamps /))
      (tstamp 5CA09FC2))
    (comp (ref J4)
      (value Audio-Jack-3_2Switches)
      (footprint w_conn_av:Tayda_3.5mm_stereo_TRS_jack_A-853)
      (libsource (lib conn) (part Audio-Jack-3_2Switches))
      (sheetpath (names /) (tstamps /))
      (tstamp 5CA0AADA))
    (comp (ref J5)
      (value Audio-Jack-3_2Switches)
      (footprint w_conn_av:Tayda_3.5mm_stereo_TRS_jack_A-853)
      (libsource (lib conn) (part Audio-Jack-3_2Switches))
      (sheetpath (names /) (tstamps /))
      (tstamp 5CA0AB3E))
    (comp (ref R2)
      (value 2K)
      (footprint Resistors_THT:R_Axial_DIN0309_L9.0mm_D3.2mm_P12.70mm_Horizontal)
      (libsource (lib device) (part R))
      (sheetpath (names /) (tstamps /))
      (tstamp 5CA0D2C7))
    (comp (ref R1)
      (value 1K)
      (footprint Resistors_THT:R_Axial_DIN0309_L9.0mm_D3.2mm_P12.70mm_Horizontal)
      (libsource (lib device) (part R))
      (sheetpath (names /) (tstamps /))
      (tstamp 5CA0D33A))
    (comp (ref J6)
      (value HC-05)
      (footprint Socket_Strips:Socket_Strip_Straight_1x04_Pitch2.54mm)
      (libsource (lib conn) (part Conn_01x04))
      (sheetpath (names /) (tstamps /))
      (tstamp 5CA0D870))
    (comp (ref J2)
      (value "ESP 8266")
      (footprint Socket_Strips:Socket_Strip_Straight_2x04_Pitch2.54mm)
      (libsource (lib conn) (part Conn_02x04_Odd_Even))
      (sheetpath (names /) (tstamps /))
      (tstamp 5CA0DD00))
    (comp (ref U1)
      (value AP1117-33)
      (footprint TO_SOT_Packages_SMD:SOT-223-3_TabPin2)
      (libsource (lib regul) (part AP1117-50))
      (sheetpath (names /) (tstamps /))
      (tstamp 5CA1025F))
    (comp (ref C2)
      (value CP)
      (footprint Capacitors_THT:CP_Radial_D5.0mm_P2.50mm)
      (libsource (lib device) (part CP))
      (sheetpath (names /) (tstamps /))
      (tstamp 5CA10270))
    (comp (ref C3)
      (value CP)
      (footprint Capacitors_THT:CP_Radial_D5.0mm_P2.50mm)
      (libsource (lib device) (part CP))
      (sheetpath (names /) (tstamps /))
      (tstamp 5CA10276))
    (comp (ref J7)
      (value "pw select")
      (footprint Pin_Headers:Pin_Header_Straight_1x03_Pitch2.54mm)
      (libsource (lib conn) (part Conn_01x03))
      (sheetpath (names /) (tstamps /))
      (tstamp 5CA10E3B))
    (comp (ref C1)
      (value CP)
      (footprint Capacitors_THT:CP_Radial_D5.0mm_P2.50mm)
      (libsource (lib device) (part CP))
      (sheetpath (names /) (tstamps /))
      (tstamp 5CA123FF))
    (comp (ref C7)
      (value 1uF)
      (footprint Capacitors_THT:C_Disc_D6.0mm_W2.5mm_P5.00mm)
      (libsource (lib device) (part C))
      (sheetpath (names /) (tstamps /))
      (tstamp 5CA15DD9))
    (comp (ref R3)
      (value 500)
      (footprint Resistors_THT:R_Axial_DIN0309_L9.0mm_D3.2mm_P12.70mm_Horizontal)
      (libsource (lib device) (part R))
      (sheetpath (names /) (tstamps /))
      (tstamp 5CA16F5B)))
  (libparts
    (libpart (lib regul) (part AP1117-15)
      (aliases
        (alias AP1117-18)
        (alias AP1117-25)
        (alias AP1117-33)
        (alias AP1117-50)
        (alias LD1117S33TR_SOT223)
        (alias LD1117S12TR_SOT223)
        (alias LD1117S18TR_SOT223)
        (alias LD1117S25TR_SOT223)
        (alias LD1117S50TR_SOT223)
        (alias NCP1117-12_SOT223)
        (alias NCP1117-1.5_SOT223)
        (alias NCP1117-1.8_SOT223)
        (alias NCP1117-2.0_SOT223)
        (alias NCP1117-2.5_SOT223)
        (alias NCP1117-2.85_SOT223)
        (alias NCP1117-3.3_SOT223)
        (alias NCP1117-5.0_SOT223))
      (description "1A Low Dropout regulator, positive, 1.5V fixed output, SOT-223")
      (docs http://www.diodes.com/datasheets/AP1117.pdf)
      (footprints
        (fp SOT?223*TabPin2*))
      (fields
        (field (name Reference) U)
        (field (name Value) AP1117-15)
        (field (name Footprint) TO_SOT_Packages_SMD:SOT-223-3Lead_TabPin2))
      (pins
        (pin (num 1) (name GND) (type power_in))
        (pin (num 2) (name VO) (type passive))
        (pin (num 3) (name VI) (type power_in))))
    (libpart (lib arduino_nano) (part Arduino_Nano)
      (fields
        (field (name Reference) A)
        (field (name Value) Arduino_Nano))
      (pins
        (pin (num 1) (name D1/RX) (type BiDi))
        (pin (num 2) (name D0/TX) (type BiDi))
        (pin (num 3) (name RESET) (type input))
        (pin (num 4) (name GND) (type power_in))
        (pin (num 5) (name D2) (type BiDi))
        (pin (num 6) (name D3) (type BiDi))
        (pin (num 7) (name D4) (type BiDi))
        (pin (num 8) (name D5) (type BiDi))
        (pin (num 9) (name D6) (type BiDi))
        (pin (num 10) (name D7) (type BiDi))
        (pin (num 11) (name D8) (type BiDi))
        (pin (num 12) (name D9) (type BiDi))
        (pin (num 13) (name D10) (type BiDi))
        (pin (num 14) (name D11) (type BiDi))
        (pin (num 15) (name D12) (type BiDi))
        (pin (num 16) (name D13) (type BiDi))
        (pin (num 17) (name 3V3) (type power_in))
        (pin (num 18) (name Aref) (type passive))
        (pin (num 19) (name AD0/D14) (type BiDi))
        (pin (num 20) (name AD1/D15) (type BiDi))
        (pin (num 21) (name AD2/D16) (type BiDi))
        (pin (num 22) (name AD3/D17) (type BiDi))
        (pin (num 23) (name AD4/D18) (type BiDi))
        (pin (num 24) (name AD5/D19) (type BiDi))
        (pin (num 25) (name AD6) (type input))
        (pin (num 26) (name AD7) (type input))
        (pin (num 27) (name 5V) (type power_in))
        (pin (num 29) (name GND) (type power_out))
        (pin (num 30) (name Vin) (type power_in))))
    (libpart (lib conn) (part Audio-Jack-3_2Switches)
      (description "3-pin audio jack receptable (stereo/TRS connector) with 2 switching contacts")
      (docs ~)
      (fields
        (field (name Reference) J)
        (field (name Value) Audio-Jack-3_2Switches))
      (pins
        (pin (num 1) (name ~) (type passive))
        (pin (num 2) (name ~) (type passive))
        (pin (num 3) (name ~) (type passive))
        (pin (num 4) (name ~) (type passive))
        (pin (num 5) (name ~) (type passive))))
    (libpart (lib conn) (part Barrel_Jack)
      (aliases
        (alias Jack-DC))
      (description "DC Barrel Jack")
      (docs ~)
      (fields
        (field (name Reference) J)
        (field (name Value) Barrel_Jack))
      (pins
        (pin (num 1) (name ~) (type passive))
        (pin (num 2) (name ~) (type passive))
        (pin (num 3) (name ~) (type passive))))
    (libpart (lib device) (part C)
      (description "Unpolarized capacitor")
      (footprints
        (fp C_*))
      (fields
        (field (name Reference) C)
        (field (name Value) C))
      (pins
        (pin (num 1) (name ~) (type passive))
        (pin (num 2) (name ~) (type passive))))
    (libpart (lib device) (part CP)
      (description "Polarised capacitor")
      (footprints
        (fp CP_*))
      (fields
        (field (name Reference) C)
        (field (name Value) CP))
      (pins
        (pin (num 1) (name ~) (type passive))
        (pin (num 2) (name ~) (type passive))))
    (libpart (lib conn) (part Conn_01x02_Female)
      (description "Generic connector, single row, 01x02")
      (docs ~)
      (footprints
        (fp Connector*:*_??x*mm*)
        (fp Connector*:*1x??x*mm*)
        (fp Socket?Strip?Straight?1X*)
        (fp Socket?Strip?Angled?1X*))
      (fields
        (field (name Reference) J)
        (field (name Value) Conn_01x02_Female))
      (pins
        (pin (num 1) (name Pin_1) (type passive))
        (pin (num 2) (name Pin_2) (type passive))))
    (libpart (lib conn) (part Conn_01x03)
      (description "Generic connector, single row, 01x03")
      (docs ~)
      (footprints
        (fp Connector*:*_??x*mm*)
        (fp Connector*:*1x??x*mm*)
        (fp Pin?Header?Straight?1X*)
        (fp Pin?Header?Angled?1X*)
        (fp Socket?Strip?Straight?1X*)
        (fp Socket?Strip?Angled?1X*))
      (fields
        (field (name Reference) J)
        (field (name Value) Conn_01x03))
      (pins
        (pin (num 1) (name Pin_1) (type passive))
        (pin (num 2) (name Pin_2) (type passive))
        (pin (num 3) (name Pin_3) (type passive))))
    (libpart (lib conn) (part Conn_01x04)
      (description "Generic connector, single row, 01x04")
      (docs ~)
      (footprints
        (fp Connector*:*_??x*mm*)
        (fp Connector*:*1x??x*mm*)
        (fp Pin?Header?Straight?1X*)
        (fp Pin?Header?Angled?1X*)
        (fp Socket?Strip?Straight?1X*)
        (fp Socket?Strip?Angled?1X*))
      (fields
        (field (name Reference) J)
        (field (name Value) Conn_01x04))
      (pins
        (pin (num 1) (name Pin_1) (type passive))
        (pin (num 2) (name Pin_2) (type passive))
        (pin (num 3) (name Pin_3) (type passive))
        (pin (num 4) (name Pin_4) (type passive))))
    (libpart (lib conn) (part Conn_02x04_Odd_Even)
      (description "Generic connector, double row, 02x04, odd/even pin numbering scheme (row 1 odd numbers, row 2 even numbers)")
      (docs ~)
      (footprints
        (fp Connector*:*2x??x*mm*)
        (fp Connector*:*2x???Pitch*)
        (fp Pin_Header_Straight_2X*)
        (fp Pin_Header_Angled_2X*)
        (fp Socket_Strip_Straight_2X*)
        (fp Socket_Strip_Angled_2X*))
      (fields
        (field (name Reference) J)
        (field (name Value) Conn_02x04_Odd_Even))
      (pins
        (pin (num 1) (name Pin_1) (type passive))
        (pin (num 2) (name Pin_2) (type passive))
        (pin (num 3) (name Pin_3) (type passive))
        (pin (num 4) (name Pin_4) (type passive))
        (pin (num 5) (name Pin_5) (type passive))
        (pin (num 6) (name Pin_6) (type passive))
        (pin (num 7) (name Pin_7) (type passive))
        (pin (num 8) (name Pin_8) (type passive))))
    (libpart (lib device) (part R)
      (description Resistor)
      (footprints
        (fp R_*)
        (fp R_*))
      (fields
        (field (name Reference) R)
        (field (name Value) R))
      (pins
        (pin (num 1) (name ~) (type passive))
        (pin (num 2) (name ~) (type passive)))))
  (libraries
    (library (logical regul)
      (uri D:\programas_d\KiCad\share\kicad\library\regul.lib))
    (library (logical conn)
      (uri D:\programas_d\KiCad\share\kicad\library\conn.lib))
    (library (logical device)
      (uri D:\programas_d\KiCad\share\kicad\library\device.lib))
    (library (logical arduino_nano)
      (uri D:\DIGIXING\proyectos\modelos_singular_toys\pcbkicad\kicad_ArduinoNano-master\libraries\arduino_nano.lib)))
  (nets
    (net (code 1) (name "Net-(J2-Pad5)")
      (node (ref J2) (pin 5)))
    (net (code 2) (name "Net-(A1-Pad1)")
      (node (ref J6) (pin 3))
      (node (ref J2) (pin 2))
      (node (ref A1) (pin 1)))
    (net (code 3) (name "Net-(A1-Pad27)")
      (node (ref J6) (pin 1))
      (node (ref A1) (pin 27)))
    (net (code 4) (name GNDREF)
      (node (ref U2) (pin 1))
      (node (ref C5) (pin 2))
      (node (ref C1) (pin 2))
      (node (ref J3) (pin 3))
      (node (ref J4) (pin 3))
      (node (ref J5) (pin 3))
      (node (ref J9) (pin 3))
      (node (ref C3) (pin 2))
      (node (ref C2) (pin 2))
      (node (ref C6) (pin 2))
      (node (ref J8) (pin 2))
      (node (ref U1) (pin 1))
      (node (ref C4) (pin 2))
      (node (ref J9) (pin 4))
      (node (ref J10) (pin 3))
      (node (ref A1) (pin 4))
      (node (ref A1) (pin 29))
      (node (ref J1) (pin 2))
      (node (ref J2) (pin 1))
      (node (ref R2) (pin 2))
      (node (ref J2) (pin 7))
      (node (ref J6) (pin 2)))
    (net (code 5) (name "Net-(J2-Pad3)")
      (node (ref J2) (pin 3)))
    (net (code 6) (name "Net-(J2-Pad6)")
      (node (ref J2) (pin 6)))
    (net (code 7) (name "Net-(A1-Pad20)")
      (node (ref A1) (pin 20))
      (node (ref J4) (pin 1)))
    (net (code 8) (name "Net-(A1-Pad21)")
      (node (ref A1) (pin 21))
      (node (ref J5) (pin 1)))
    (net (code 9) (name "Net-(J6-Pad4)")
      (node (ref R2) (pin 1))
      (node (ref J6) (pin 4))
      (node (ref R1) (pin 2)))
    (net (code 10) (name "Net-(A1-Pad2)")
      (node (ref A1) (pin 2))
      (node (ref R1) (pin 1)))
    (net (code 11) (name "Net-(A1-Pad17)")
      (node (ref A1) (pin 17))
      (node (ref J7) (pin 3)))
    (net (code 12) (name "Net-(C3-Pad1)")
      (node (ref U1) (pin 2))
      (node (ref J7) (pin 1))
      (node (ref C3) (pin 1)))
    (net (code 13) (name "Net-(A1-Pad24)")
      (node (ref J3) (pin 2))
      (node (ref A1) (pin 24)))
    (net (code 14) (name "Net-(A1-Pad5)")
      (node (ref R3) (pin 1))
      (node (ref A1) (pin 5)))
    (net (code 15) (name "Net-(C1-Pad1)")
      (node (ref C1) (pin 1))
      (node (ref J2) (pin 4))
      (node (ref J2) (pin 8))
      (node (ref J7) (pin 2)))
    (net (code 16) (name "Net-(A1-Pad19)")
      (node (ref J3) (pin 1))
      (node (ref A1) (pin 19)))
    (net (code 17) (name "Net-(C7-Pad2)")
      (node (ref C7) (pin 2))
      (node (ref J8) (pin 1)))
    (net (code 18) (name "Net-(J10-Pad2)")
      (node (ref R3) (pin 2))
      (node (ref J9) (pin 2))
      (node (ref J10) (pin 2)))
    (net (code 19) (name "Net-(A1-Pad6)")
      (node (ref A1) (pin 6))
      (node (ref C7) (pin 1)))
    (net (code 20) (name "Net-(J1-Pad3)")
      (node (ref J1) (pin 3)))
    (net (code 21) (name "Net-(A1-Pad13)")
      (node (ref A1) (pin 13)))
    (net (code 22) (name "Net-(A1-Pad3)")
      (node (ref A1) (pin 3)))
    (net (code 23) (name "Net-(A1-Pad7)")
      (node (ref A1) (pin 7)))
    (net (code 24) (name "Net-(A1-Pad8)")
      (node (ref A1) (pin 8)))
    (net (code 25) (name "Net-(A1-Pad9)")
      (node (ref A1) (pin 9)))
    (net (code 26) (name "Net-(A1-Pad10)")
      (node (ref A1) (pin 10)))
    (net (code 27) (name "Net-(A1-Pad11)")
      (node (ref A1) (pin 11)))
    (net (code 28) (name "Net-(A1-Pad12)")
      (node (ref A1) (pin 12)))
    (net (code 29) (name "Net-(A1-Pad14)")
      (node (ref A1) (pin 14)))
    (net (code 30) (name "Net-(A1-Pad15)")
      (node (ref A1) (pin 15)))
    (net (code 31) (name "Net-(A1-Pad25)")
      (node (ref A1) (pin 25)))
    (net (code 32) (name "Net-(A1-Pad16)")
      (node (ref A1) (pin 16)))
    (net (code 33) (name "Net-(A1-Pad26)")
      (node (ref A1) (pin 26)))
    (net (code 34) (name "Net-(A1-Pad18)")
      (node (ref A1) (pin 18)))
    (net (code 35) (name "Net-(J3-Pad5)")
      (node (ref J3) (pin 5)))
    (net (code 36) (name "Net-(J3-Pad4)")
      (node (ref J3) (pin 4)))
    (net (code 37) (name "Net-(A1-Pad23)")
      (node (ref A1) (pin 23))
      (node (ref J4) (pin 2)))
    (net (code 38) (name "Net-(J4-Pad4)")
      (node (ref J4) (pin 4)))
    (net (code 39) (name "Net-(J4-Pad5)")
      (node (ref J4) (pin 5)))
    (net (code 40) (name "Net-(A1-Pad22)")
      (node (ref J5) (pin 2))
      (node (ref A1) (pin 22)))
    (net (code 41) (name "Net-(J5-Pad4)")
      (node (ref J5) (pin 4)))
    (net (code 42) (name "Net-(J5-Pad5)")
      (node (ref J5) (pin 5)))
    (net (code 43) (name "Net-(A1-Pad30)")
      (node (ref C5) (pin 1))
      (node (ref J10) (pin 1))
      (node (ref A1) (pin 30))
      (node (ref J9) (pin 1))
      (node (ref C6) (pin 1))
      (node (ref U2) (pin 2)))
    (net (code 44) (name "Net-(C2-Pad1)")
      (node (ref U1) (pin 3))
      (node (ref C2) (pin 1))
      (node (ref J1) (pin 1))
      (node (ref U2) (pin 3))
      (node (ref C4) (pin 1)))))