{
    "tsconfig": "../tsconfig.json",
    "entryPoints": [
        "../src/mysocket",
        "manual"
    ],
    "entryPointStrategy": "resolve",
    "out": "../public",
    "includeVersion": true,
    "readme": "manual/main.md",
    "name": "@open-kappa/mysocket",
    "excludeInternal": true,
    "excludeExternals": false,
    "excludePrivate": true,
    "excludeProtected": false,
    "disableSources": true,
    "includes": [
        "manual/src"
    ],
    "exclude": [
        "../src/mysocket/index.ts",
        "../src/mysocket/mysocketImpl.ts",
        "../src/tests",
        "../src/custom_ts_d"
    ],
    "sort": ["source-order"]
}
