{
    "version": "1.0.0",
    "backup-test": {
        "destination": {
            "host": "localhost",
            "user": "",
            "path": "/tmp/backups",
            "git": {
                "enabled": false,
                "push": true
            },
            "tgz": {
                "enabled": false,
                "retention": {
                    "days": 3,
                    "weeks": 3,
                    "months": 6,
                    "years": 3
                }
            }
        },
        "audit": {
            "logFile": "/tmp/backups/log.txt",
            "scripts": [],
            "telegram": {
                "sendPolicy": "warning",
                "chatId": "AAA-BBB",
                "botToken": "CCC_DDD",
                "url": ""
            },
            "email": {
                "sendPolicy": "warning",
                "host": "smtp.test.me",
                "port": 587,
                "secure": false,
                "user": "myself",
                "password": "super-secret",
                "from": "",
                "to": []
            }
        },
        "remote-task": [
            {
                "destinationSubdir": "",
                "host": "127.0.0.1",
                "user": "kappa",
                "preCommands": [],
                "paths": [
                    "/home/kappa/.node-red/flows.json"
                ],
                "postCommands": [],
                "subTargets": [],
                "disabled": false
            }
        ],
        "local-task": [
            {
                "destinationSubdir": "",
                "host": "localhost",
                "user": "",
                "preCommands": [],
                "paths": [
                    "/home/kappa/.node-red/flows.json"
                ],
                "postCommands": [
                    "echo \"Hello!\""
                ],
                "disabled": false
            }
        ]
    }
}
