[
    {
        "id": "f378485deda98ed4",
        "type": "tab",
        "label": "Support",
        "disabled": false,
        "info": ""
    },
    {
        "id": "882358c02f33183a",
        "type": "tab",
        "label": "Basic",
        "disabled": false,
        "info": "",
        "env": []
    },
    {
        "id": "affb6b9c.6a3bf",
        "type": "tab",
        "label": "Bugs",
        "disabled": false,
        "info": ""
    },
    {
        "id": "808630de.b687a8",
        "type": "mydbConfig",
        "name": "Fake db",
        "host": "10.10.10.10",
        "port": "5433",
        "database": "postgres",
        "ssl": false,
        "rejectUnauthorized": false,
        "ca": "",
        "key": "",
        "cert": "",
        "max": "10",
        "min": "1",
        "idle": "1000"
    },
    {
        "id": "1b17785e.695b18",
        "type": "mydbConfig",
        "name": "test postgres",
        "host": "localhost",
        "port": "5432",
        "database": "postgres",
        "ssl": false,
        "rejectUnauthorized": false,
        "ca": "",
        "key": "",
        "cert": "",
        "max": "10",
        "min": "1",
        "idle": "1000"
    },
    {
        "id": "997c156a7d3c6f7a",
        "type": "inject",
        "z": "f378485deda98ed4",
        "name": "createTest",
        "props": [
            {
                "p": "payload"
            },
            {
                "p": "topic",
                "vt": "str"
            }
        ],
        "repeat": "",
        "crontab": "",
        "once": false,
        "onceDelay": 0.1,
        "topic": "",
        "payloadType": "date",
        "x": 120,
        "y": 60,
        "wires": [
            [
                "d7cb78c9744e8361"
            ]
        ]
    },
    {
        "id": "db54429e20fa19da",
        "type": "catch",
        "z": "f378485deda98ed4",
        "name": "",
        "scope": null,
        "uncaught": false,
        "x": 600,
        "y": 120,
        "wires": [
            [
                "7131a4dcb5a99e82"
            ]
        ]
    },
    {
        "id": "e255f2dd7d1c54fb",
        "type": "debug",
        "z": "f378485deda98ed4",
        "name": "ok",
        "active": true,
        "tosidebar": true,
        "console": false,
        "tostatus": false,
        "complete": "true",
        "targetType": "full",
        "statusVal": "",
        "statusType": "auto",
        "x": 850,
        "y": 60,
        "wires": []
    },
    {
        "id": "7131a4dcb5a99e82",
        "type": "debug",
        "z": "f378485deda98ed4",
        "name": "err",
        "active": true,
        "tosidebar": true,
        "console": false,
        "tostatus": false,
        "complete": "true",
        "targetType": "full",
        "statusVal": "",
        "statusType": "auto",
        "x": 850,
        "y": 120,
        "wires": []
    },
    {
        "id": "d7cb78c9744e8361",
        "type": "function",
        "z": "f378485deda98ed4",
        "name": "create Test",
        "func": "\nreturn {\n    \"query\": 'create table IF NOT EXISTS \"Test\"('\n        + 'value text'\n        + ')'\n};",
        "outputs": 1,
        "noerr": 0,
        "initialize": "",
        "finalize": "",
        "libs": [],
        "x": 310,
        "y": 60,
        "wires": [
            [
                "076805ddf2bdd621"
            ]
        ]
    },
    {
        "id": "901c271891568ec2",
        "type": "function",
        "z": "f378485deda98ed4",
        "name": "delete Test",
        "func": "\nreturn {\n    \"query\": 'drop table IF EXISTS \"Test\"'\n};",
        "outputs": 1,
        "noerr": 0,
        "initialize": "",
        "finalize": "",
        "libs": [],
        "x": 310,
        "y": 120,
        "wires": [
            [
                "076805ddf2bdd621"
            ]
        ]
    },
    {
        "id": "a889dc14ef08db70",
        "type": "inject",
        "z": "f378485deda98ed4",
        "name": "deleteTest",
        "props": [
            {
                "p": "payload"
            },
            {
                "p": "topic",
                "vt": "str"
            }
        ],
        "repeat": "",
        "crontab": "",
        "once": false,
        "onceDelay": 0.1,
        "topic": "",
        "payloadType": "date",
        "x": 120,
        "y": 120,
        "wires": [
            [
                "901c271891568ec2"
            ]
        ]
    },
    {
        "id": "076805ddf2bdd621",
        "type": "mydb",
        "z": "f378485deda98ed4",
        "name": "db",
        "style": "mustache",
        "substEnvVars": false,
        "query": "{{{msg.query}}};",
        "mydbConfig": "1b17785e.695b18",
        "x": 590,
        "y": 60,
        "wires": [
            [
                "e255f2dd7d1c54fb"
            ]
        ]
    },
    {
        "id": "f448aa180a2d9ef0",
        "type": "inject",
        "z": "882358c02f33183a",
        "name": "write",
        "props": [
            {
                "p": "payload"
            },
            {
                "p": "topic",
                "vt": "str"
            }
        ],
        "repeat": "",
        "crontab": "",
        "once": false,
        "onceDelay": 0.1,
        "topic": "",
        "payload": "",
        "payloadType": "date",
        "x": 130,
        "y": 60,
        "wires": [
            [
                "d7cf4d7262710a34"
            ]
        ]
    },
    {
        "id": "f9f076dcd13a2629",
        "type": "catch",
        "z": "882358c02f33183a",
        "name": "",
        "scope": null,
        "uncaught": false,
        "x": 620,
        "y": 120,
        "wires": [
            [
                "99ea8d668a33c159"
            ]
        ]
    },
    {
        "id": "b4a791d8b9eb70dc",
        "type": "debug",
        "z": "882358c02f33183a",
        "name": "ok",
        "active": true,
        "tosidebar": true,
        "console": false,
        "tostatus": false,
        "complete": "true",
        "targetType": "full",
        "statusVal": "",
        "statusType": "auto",
        "x": 870,
        "y": 60,
        "wires": []
    },
    {
        "id": "99ea8d668a33c159",
        "type": "debug",
        "z": "882358c02f33183a",
        "name": "err",
        "active": true,
        "tosidebar": true,
        "console": false,
        "tostatus": false,
        "complete": "true",
        "targetType": "full",
        "statusVal": "",
        "statusType": "auto",
        "x": 870,
        "y": 120,
        "wires": []
    },
    {
        "id": "d7cf4d7262710a34",
        "type": "function",
        "z": "882358c02f33183a",
        "name": "write \"Ciao!\"",
        "func": "\nreturn {\n    \"query\": 'insert into \"Test\"('\n        + 'value'\n        + ')'\n        + \" values ('Ciao!')\"\n};",
        "outputs": 1,
        "noerr": 0,
        "initialize": "",
        "finalize": "",
        "libs": [],
        "x": 330,
        "y": 60,
        "wires": [
            [
                "7e42a9029964f874"
            ]
        ]
    },
    {
        "id": "80b8ea8470b48e7e",
        "type": "function",
        "z": "882358c02f33183a",
        "name": "read Test",
        "func": "\nreturn {\n    \"query\": 'select * from \"Test\"'\n};",
        "outputs": 1,
        "noerr": 0,
        "initialize": "",
        "finalize": "",
        "libs": [],
        "x": 320,
        "y": 120,
        "wires": [
            [
                "7e42a9029964f874"
            ]
        ]
    },
    {
        "id": "075bc48232dbe672",
        "type": "inject",
        "z": "882358c02f33183a",
        "name": "read",
        "props": [
            {
                "p": "payload"
            },
            {
                "p": "topic",
                "vt": "str"
            }
        ],
        "repeat": "",
        "crontab": "",
        "once": false,
        "onceDelay": 0.1,
        "topic": "",
        "payload": "",
        "payloadType": "date",
        "x": 130,
        "y": 120,
        "wires": [
            [
                "80b8ea8470b48e7e"
            ]
        ]
    },
    {
        "id": "7e42a9029964f874",
        "type": "mydb",
        "z": "882358c02f33183a",
        "name": "db",
        "style": "mustache",
        "substEnvVars": false,
        "query": "{{{msg.query}}};",
        "mydbConfig": "1b17785e.695b18",
        "x": 610,
        "y": 60,
        "wires": [
            [
                "b4a791d8b9eb70dc"
            ]
        ]
    },
    {
        "id": "6d42a33e22613822",
        "type": "inject",
        "z": "882358c02f33183a",
        "name": "error",
        "props": [
            {
                "p": "payload"
            },
            {
                "p": "topic",
                "vt": "str"
            }
        ],
        "repeat": "",
        "crontab": "",
        "once": false,
        "onceDelay": 0.1,
        "topic": "",
        "payload": "",
        "payloadType": "date",
        "x": 130,
        "y": 180,
        "wires": [
            [
                "f00dfdabb3d0abe8"
            ]
        ]
    },
    {
        "id": "f00dfdabb3d0abe8",
        "type": "function",
        "z": "882358c02f33183a",
        "name": "error",
        "func": "return {\n    \"query\": 'insert into \"Test\"('\n        + 'error'\n        + ')'\n        + \" values ('Ciao!')\"\n};",
        "outputs": 1,
        "noerr": 0,
        "initialize": "",
        "finalize": "",
        "libs": [],
        "x": 310,
        "y": 180,
        "wires": [
            [
                "7e42a9029964f874"
            ]
        ]
    },
    {
        "id": "a3b8e045.70b11",
        "type": "mydb",
        "z": "affb6b9c.6a3bf",
        "name": "catch",
        "style": "handlebars",
        "substEnvVars": false,
        "query": "SELECT * FROM {{msg.tableName}};",
        "mydbConfig": "808630de.b687a8",
        "x": 430,
        "y": 80,
        "wires": [
            [
                "4c12fb8a.378b2c"
            ]
        ]
    },
    {
        "id": "82f02160.5b6d58",
        "type": "inject",
        "z": "affb6b9c.6a3bf",
        "name": "Catch",
        "props": [
            {
                "p": "payload"
            },
            {
                "p": "topic",
                "vt": "str"
            }
        ],
        "repeat": "",
        "crontab": "",
        "once": false,
        "onceDelay": 0.1,
        "topic": "",
        "payload": "",
        "payloadType": "date",
        "x": 130,
        "y": 80,
        "wires": [
            [
                "e17d030a.06bf4"
            ]
        ]
    },
    {
        "id": "e17d030a.06bf4",
        "type": "function",
        "z": "affb6b9c.6a3bf",
        "name": "set query",
        "func": "\nreturn {\n    \"tableName\": \"errorTable\"\n};",
        "outputs": 1,
        "noerr": 0,
        "initialize": "",
        "finalize": "",
        "libs": [],
        "x": 280,
        "y": 80,
        "wires": [
            [
                "a3b8e045.70b11"
            ]
        ]
    },
    {
        "id": "4c12fb8a.378b2c",
        "type": "debug",
        "z": "affb6b9c.6a3bf",
        "name": "DBG out",
        "active": true,
        "tosidebar": true,
        "console": true,
        "tostatus": false,
        "complete": "true",
        "targetType": "full",
        "statusVal": "",
        "statusType": "auto",
        "x": 630,
        "y": 80,
        "wires": []
    },
    {
        "id": "269bb55.10124ca",
        "type": "catch",
        "z": "affb6b9c.6a3bf",
        "name": "",
        "scope": [
            "a3b8e045.70b11"
        ],
        "uncaught": false,
        "x": 430,
        "y": 140,
        "wires": [
            [
                "a1e28d43.f138e8"
            ]
        ]
    },
    {
        "id": "a1e28d43.f138e8",
        "type": "debug",
        "z": "affb6b9c.6a3bf",
        "name": "DBG err",
        "active": true,
        "tosidebar": true,
        "console": true,
        "tostatus": false,
        "complete": "true",
        "targetType": "full",
        "statusVal": "",
        "statusType": "auto",
        "x": 630,
        "y": 140,
        "wires": []
    },
    {
        "id": "6a93734f.52b264",
        "type": "inject",
        "z": "affb6b9c.6a3bf",
        "name": "Issue #8",
        "props": [
            {
                "p": "payload"
            },
            {
                "p": "topic",
                "vt": "str"
            }
        ],
        "repeat": "",
        "crontab": "",
        "once": false,
        "onceDelay": 0.1,
        "topic": "",
        "payload": "",
        "payloadType": "date",
        "x": 120,
        "y": 220,
        "wires": [
            [
                "1d9132eb.e4fdd5"
            ]
        ]
    },
    {
        "id": "1d9132eb.e4fdd5",
        "type": "mydb",
        "z": "affb6b9c.6a3bf",
        "name": "issue #8",
        "style": "mustache",
        "substEnvVars": false,
        "query": "BAD QUERY;",
        "mydbConfig": "1b17785e.695b18",
        "x": 280,
        "y": 220,
        "wires": [
            [
                "e4198879.62743"
            ]
        ]
    },
    {
        "id": "e4198879.62743",
        "type": "debug",
        "z": "affb6b9c.6a3bf",
        "name": "DBG out",
        "active": true,
        "tosidebar": true,
        "console": true,
        "tostatus": false,
        "complete": "true",
        "targetType": "full",
        "statusVal": "",
        "statusType": "auto",
        "x": 450,
        "y": 220,
        "wires": []
    },
    {
        "id": "a6570262.3c0d68",
        "type": "comment",
        "z": "affb6b9c.6a3bf",
        "name": "Catchable errors",
        "info": "",
        "x": 160,
        "y": 40,
        "wires": []
    },
    {
        "id": "6d6c6ec9.880fb8",
        "type": "comment",
        "z": "affb6b9c.6a3bf",
        "name": "#8 connection not closed on errors",
        "info": "",
        "x": 200,
        "y": 180,
        "wires": []
    },
    {
        "id": "b980f13b.bc9ef",
        "type": "inject",
        "z": "affb6b9c.6a3bf",
        "name": "Issue #9",
        "props": [
            {
                "p": "payload"
            },
            {
                "p": "topic",
                "vt": "str"
            }
        ],
        "repeat": "",
        "crontab": "",
        "once": false,
        "onceDelay": 0.1,
        "topic": "",
        "payload": "",
        "payloadType": "date",
        "x": 120,
        "y": 320,
        "wires": [
            [
                "955955e.dd35ca8"
            ]
        ]
    },
    {
        "id": "c42c3039.9aae6",
        "type": "mydb",
        "z": "affb6b9c.6a3bf",
        "name": "issue #9",
        "style": "mustache",
        "substEnvVars": false,
        "query": "insert into \"Test\" values ('{{msg.value}}');",
        "mydbConfig": "1b17785e.695b18",
        "x": 480,
        "y": 320,
        "wires": [
            [
                "ea4b05b1.9a3818"
            ]
        ]
    },
    {
        "id": "ea4b05b1.9a3818",
        "type": "debug",
        "z": "affb6b9c.6a3bf",
        "name": "DBG out",
        "active": true,
        "tosidebar": true,
        "console": true,
        "tostatus": false,
        "complete": "true",
        "targetType": "full",
        "statusVal": "",
        "statusType": "auto",
        "x": 650,
        "y": 320,
        "wires": []
    },
    {
        "id": "458e0313.efd04c",
        "type": "comment",
        "z": "affb6b9c.6a3bf",
        "name": "#9 connection goes down",
        "info": "",
        "x": 170,
        "y": 280,
        "wires": []
    },
    {
        "id": "955955e.dd35ca8",
        "type": "function",
        "z": "affb6b9c.6a3bf",
        "name": "Generate text",
        "func": "msg.value = \"Test_\" + Math.random();\nreturn msg;",
        "outputs": 1,
        "noerr": 0,
        "initialize": "",
        "finalize": "",
        "libs": [],
        "x": 300,
        "y": 320,
        "wires": [
            [
                "c42c3039.9aae6"
            ]
        ]
    },
    {
        "id": "18accb2a.edd5ed",
        "type": "inject",
        "z": "affb6b9c.6a3bf",
        "name": "Issue #9",
        "props": [
            {
                "p": "payload"
            },
            {
                "p": "topic",
                "vt": "str"
            }
        ],
        "repeat": "10",
        "crontab": "",
        "once": false,
        "onceDelay": 0.1,
        "topic": "",
        "payload": "",
        "payloadType": "date",
        "x": 120,
        "y": 440,
        "wires": [
            [
                "cd17a980.10789"
            ]
        ]
    },
    {
        "id": "cd17a980.10789",
        "type": "function",
        "z": "affb6b9c.6a3bf",
        "name": "Periodic",
        "func": "node.log(\"Periodic task\");",
        "outputs": 0,
        "noerr": 0,
        "initialize": "",
        "finalize": "",
        "libs": [],
        "x": 280,
        "y": 440,
        "wires": []
    },
    {
        "id": "1afc41aa.f305ce",
        "type": "inject",
        "z": "affb6b9c.6a3bf",
        "name": "Issue #9",
        "props": [
            {
                "p": "payload"
            },
            {
                "p": "topic",
                "vt": "str"
            }
        ],
        "repeat": "",
        "crontab": "",
        "once": false,
        "onceDelay": 0.1,
        "topic": "",
        "payload": "",
        "payloadType": "date",
        "x": 120,
        "y": 380,
        "wires": [
            [
                "452fd2c3.015264"
            ]
        ]
    },
    {
        "id": "452fd2c3.015264",
        "type": "function",
        "z": "affb6b9c.6a3bf",
        "name": "Specific text",
        "func": "msg.value = \"Hi!\";\nreturn msg;",
        "outputs": 1,
        "noerr": 0,
        "initialize": "",
        "finalize": "",
        "libs": [],
        "x": 290,
        "y": 380,
        "wires": [
            [
                "c42c3039.9aae6"
            ]
        ]
    }
]