<?xml version="1.0" standalone="no"?>
<!DOCTYPE svg PUBLIC "-//W3C//DTD SVG 1.1//EN" "http://www.w3.org/Graphics/SVG/1.1/DTD/svg11.dtd">
<svg width="105mm" height="502mm" viewBox="0 -502 105 502" xmlns="http://www.w3.org/2000/svg" version="1.1">
<title>OpenSCAD Model</title>
<path d="
M 30,-476.5 L 35,-476.5 L 35,-481.5 L 30,-481.5 L 30,-484.5 L 35,-484.5
 L 35,-489.5 L 30,-489.5 L 30,-492.5 L 35,-492.5 L 35,-497.5 L 30,-497.5
 L 30,-501.5 L 0,-501.5 L 0,-471.5 L 30,-471.5 z
M 10,-492.5 L 10,-497.5 L 15,-497.5 L 15,-492.5 z
M 10,-484.5 L 10,-489.5 L 15,-489.5 L 15,-484.5 z
M 10,-476.5 L 10,-481.5 L 15,-481.5 L 15,-476.5 z
M 15,-430.5 L 20,-430.5 L 20,-425.5 L 25,-425.5 L 25,-430.5 L 30,-430.5
 L 30,-425.5 L 35,-425.5 L 35,-430.5 L 40,-430.5 L 40,-425.5 L 45,-425.5
 L 45,-430.5 L 50,-430.5 L 50,-425.5 L 55,-425.5 L 55,-430.5 L 60,-430.5
 L 60,-425.5 L 65,-425.5 L 65,-430.5 L 70,-430.5 L 70,-425.5 L 75,-425.5
 L 75,-430.5 L 80,-430.5 L 80,-425.5 L 85,-425.5 L 85,-430.5 L 90,-430.5
 L 90,-425.5 L 95,-425.5 L 95,-430.5 L 105,-430.5 L 105,-465.5 L 97.6316,-465.5
 L 97.7705,-464.681 L 98,-460.5 L 97.7705,-456.319 L 97.0922,-452.32 L 95.9947,-448.68 L 94.5259,-445.555
 L 92.75,-443.084 L 90.7447,-441.374 L 88.5975,-440.5 L 86.4025,-440.5 L 84.2553,-441.374 L 82.25,-443.084
 L 80.4741,-445.555 L 79.0053,-448.68 L 77.9078,-452.32 L 77.2294,-456.319 L 77,-460.5 L 77.2294,-464.681
 L 77.3684,-465.5 L 62.6316,-465.5 L 62.7705,-464.681 L 63,-460.5 L 62.7705,-456.319 L 62.0922,-452.32
 L 60.9947,-448.68 L 59.5259,-445.555 L 57.75,-443.084 L 55.7447,-441.374 L 53.5975,-440.5 L 51.4025,-440.5
 L 49.2553,-441.374 L 47.25,-443.084 L 45.4741,-445.555 L 44.0053,-448.68 L 42.9078,-452.32 L 42.2294,-456.319
 L 42,-460.5 L 42.2294,-464.681 L 42.3684,-465.5 L 27.6316,-465.5 L 27.7705,-464.681 L 28,-460.5
 L 27.7705,-456.319 L 27.0922,-452.32 L 25.9947,-448.68 L 24.5259,-445.555 L 22.75,-443.084 L 20.7447,-441.374
 L 18.5975,-440.5 L 16.4025,-440.5 L 14.2553,-441.374 L 12.25,-443.084 L 10.4741,-445.555 L 9.00531,-448.68
 L 7.90776,-452.32 L 7.22945,-456.319 L 7,-460.5 L 7.22945,-464.681 L 7.36836,-465.5 L 0,-465.5
 L 0,-430.5 L 10,-430.5 L 10,-425.5 L 15,-425.5 z
M 7.22945,-4.18114 L 7.90776,-8.17953 L 9.00531,-11.8204 L 10.4741,-14.9448 L 12.25,-17.4159 L 14.2553,-19.1259
 L 16.4025,-20 L 18.5975,-20 L 20.7447,-19.1259 L 22.75,-17.4159 L 24.5259,-14.9448 L 25.9947,-11.8204
 L 27.0922,-8.17953 L 27.7705,-4.18114 L 28,-0 L 42,-0 L 42.2294,-4.18114 L 42.9078,-8.17953
 L 44.0053,-11.8204 L 45.4741,-14.9448 L 47.25,-17.4159 L 49.2553,-19.1259 L 51.4025,-20 L 53.5975,-20
 L 55.7447,-19.1259 L 57.75,-17.4159 L 59.5259,-14.9448 L 60.9947,-11.8204 L 62.0922,-8.17953 L 62.7705,-4.18114
 L 63,-0 L 77,-0 L 77.2294,-4.18114 L 77.9078,-8.17953 L 79.0053,-11.8204 L 80.4741,-14.9448
 L 82.25,-17.4159 L 84.2553,-19.1259 L 86.4025,-20 L 88.5975,-20 L 90.7447,-19.1259 L 92.75,-17.4159
 L 94.5259,-14.9448 L 95.9947,-11.8204 L 97.0922,-8.17953 L 97.7705,-4.18114 L 98,-0 L 105,-0
 L 105,-420 L 0,-420 L 0,-0 L 7,-0 z
M 20,-160 L 20,-165 L 25,-165 L 25,-160 z
M 90,-160 L 90,-165 L 95,-165 L 95,-160 z
M 30,-160 L 30,-165 L 35,-165 L 35,-160 z
M 40,-160 L 40,-165 L 45,-165 L 45,-160 z
M 70,-160 L 70,-165 L 75,-165 L 75,-160 z
M 50,-160 L 50,-165 L 55,-165 L 55,-160 z
M 10,-160 L 10,-165 L 15,-165 L 15,-160 z
M 60,-160 L 60,-165 L 65,-165 L 65,-160 z
M 80,-160 L 80,-165 L 85,-165 L 85,-160 z
" stroke="black" fill="lightgray" stroke-width="0.5"/>
</svg>
